Want to show your appreciation and help with hosting costs? Support us on Patreon!
Description: Octopi Sysinfo
Submitted on June 4, 2021 at 04:34 AM
Expires on July 4, 2021 at 04:34 AM (1 week from now)

New Paste 1 (Text)

123456789101112131415161718192021222324252627282930313233343536373839404142434445464748495051525354555657585960616263646566676869707172737475767778798081828384858687888990919293949596979899100101102103104105106107108109110111112113114115116117118119120121122123124125126127128129130131132133134135136137138139140141142143144145146147148149150151152153154155156157158159160161162163164165166167168169170171172173174175176177178179180181182183184185186187188189190191192193194195196197198199200201202203204205206207208209210211212213214215216217218219220221222223224225226227228229230231232233234235236237238239240241242243244245246247248249250251252253254255256257258259260261262263264265266267268269270271272273274275276277278279280281282283284285286287288289290291292293294295296297298299300301302303304305306307308309310311312313314315316317318319320321322323324325326327328329330331332333334335336337338339340341342343344345346347348349350351352353354355356357358359360361362363364365366367368369370371372373374375376377378379380381382383384385386387388389390391392393394395396397398399400401402403404405406407408409410411412413414415416417418419420421422423424425426427428429430431432433434435436437438439440441442443444445446447448449450451452453454455456457458459460461462463464465466467468469470471472473474475476477478479480481482483484485486487488489490491492493494495496497498499500501502503504505506507508509510511512513514515516517518519520521522523524525526527528529530531532533534535536537538539540541542543544545546547548549550551552553554555556557558559560561562563564565566567568569570571572573574575576577578579580581582583584585586587588589590591592593594595596597598599600601602603604605606607608609610611612613614615616617618619620621622623624625626627628629630631632633634635636637638639640641642643644645646647648649650651652653654655656657658659660661662663664665666667668669670671672673674675676677678679680681682683684685686687688689690691692693694695696697698699700701702703704705706707708709710711712713714715716717718719720721722723724725726727728729730731732733734735736737738739740741742743744745746747748749750751752753754755756757758759760761762763764765766767768769770771772773774775776777778779780781782783784785786787788789790791792793794795796797798799800801802803804805806807808809810811812813814815816817818819820821822823824825826827828829830831832833834835836837838839840841842843844845846847848849850851852853854855856857858859860861862863864865866867868869870871872873874875876877878879880881882883884885886887888889890891892893894895896897898899900901902903904905906907908909910911912913914915916917918919920921922923924925926927928929930931932933934935936937938939940941942943944945946947948949950951952953954955956957958959960961962963964965966967968969970971972973974975976977978979980981982983984985986987988989990991992993994995996997998999100010011002100310041005100610071008100910101011101210131014101510161017101810191020102110221023102410251026102710281029103010311032103310341035103610371038103910401041104210431044104510461047104810491050105110521053105410551056105710581059106010611062106310641065106610671068106910701071107210731074107510761077107810791080108110821083108410851086108710881089109010911092109310941095109610971098109911001101110211031104110511061107110811091110111111121113111411151116111711181119112011211122112311241125112611271128112911301131113211331134113511361137113811391140114111421143114411451146114711481149115011511152115311541155115611571158115911601161116211631164116511661167116811691170117111721173117411751176117711781179118011811182118311841185118611871188118911901191119211931194119511961197119811991200120112021203120412051206120712081209121012111212121312141215121612171218121912201221122212231224122512261227122812291230123112321233123412351236123712381239124012411242124312441245124612471248124912501251125212531254125512561257125812591260126112621263126412651266126712681269127012711272127312741275127612771278127912801281128212831284128512861287128812891290129112921293129412951296129712981299130013011302130313041305130613071308130913101311131213131314131513161317131813191320132113221323132413251326132713281329133013311332133313341335133613371338133913401341134213431344134513461347134813491350135113521353135413551356135713581359136013611362136313641365136613671368136913701371137213731374137513761377137813791380138113821383138413851386138713881389139013911392139313941395139613971398139914001401140214031404140514061407140814091410141114121413141414151416141714181419142014211422142314241425142614271428142914301431143214331434143514361437143814391440144114421443144414451446144714481449145014511452145314541455145614571458145914601461146214631464146514661467146814691470147114721473147414751476147714781479148014811482148314841485148614871488148914901491149214931494149514961497149814991500150115021503150415051506150715081509151015111512151315141515151615171518151915201521152215231524152515261527152815291530153115321533153415351536153715381539154015411542154315441545154615471548154915501551155215531554155515561557155815591560156115621563156415651566156715681569157015711572157315741575157615771578157915801581158215831584158515861587158815891590159115921593159415951596159715981599160016011602160316041605160616071608160916101611161216131614161516161617161816191620162116221623162416251626162716281629163016311632163316341635163616371638163916401641164216431644164516461647164816491650165116521653165416551656165716581659166016611662166316641665166616671668166916701671167216731674167516761677167816791680168116821683168416851686168716881689169016911692169316941695169616971698169917001701170217031704170517061707170817091710171117121713171417151716171717181719172017211722172317241725172617271728172917301731173217331734173517361737173817391740174117421743174417451746174717481749175017511752175317541755175617571758175917601761176217631764176517661767176817691770177117721773177417751776177717781779178017811782178317841785178617871788178917901791179217931794179517961797179817991800180118021803180418051806180718081809181018111812181318141815181618171818181918201821182218231824182518261827182818291830183118321833183418351836183718381839184018411842184318441845184618471848184918501851185218531854185518561857185818591860186118621863186418651866186718681869187018711872187318741875187618771878187918801881188218831884188518861887188818891890189118921893189418951896189718981899190019011902190319041905190619071908190919101911191219131914191519161917191819191920192119221923192419251926192719281929193019311932193319341935193619371938193919401941194219431944194519461947194819491950
----------------------------------------------------------------------------------------------------------
cat /etc/KaOS-release
----------------------------------------------------------------------------------------------------------

KAOS_20210423

----------------------------------------------------------------------------------------------------------
inxi -Fxz
----------------------------------------------------------------------------------------------------------

System:    Kernel: 5.11.16-1 x86_64 bits: 64 compiler: gcc v: 10.3.0 Desktop: KDE Plasma 5.21.5 
           Distro: KaOS 2021 
Machine:   Type: Desktop System: Google product: Rammus v: 1.0 serial: <filter> 
           Mobo: Google model: Rammus v: 1.0 serial: <filter> UEFI: coreboot v: MrChromebox-4.12 
           date: 06/04/2020 
Battery:   ID-1: BAT0 charge: 40.4 Wh (100.0%) condition: 40.4/48.1 Wh (84.0%) volts: 12.8 
           min: 11.9 model: AS1GUIc C434-41 status: Charging 
CPU:       Info: Dual Core model: Intel Core m3-8100Y bits: 64 type: MT MCP arch: Amber/Kaby Lake 
           note: check rev: 9 cache: L2: 4 MiB 
           flags: avx avx2 lm nx pae sse sse2 sse3 sse4_1 sse4_2 ssse3 vmx bogomips: 12799 
           Speed: 580 MHz min/max: 400/3400 MHz Core speeds (MHz): 1: 580 2: 600 3: 585 4: 554 
Graphics:  Device-1: Intel UHD Graphics 615 vendor: Google driver: i915 v: kernel bus-ID: 00:02.0 
           Device-2: IMC Networks USB2.0 HD UVC WebCam type: USB driver: uvcvideo bus-ID: 1-9:4 
           Display: x11 server: X.Org 1.20.11 driver: loaded: modesetting unloaded: vesa 
           resolution: 1920x1080~60Hz 
           OpenGL: renderer: Mesa Intel UHD Graphics 615 (AML-KBL) v: 4.6 Mesa 21.1.1 
           direct render: Yes 
Audio:     Device-1: Intel Sunrise Point-LP HD Audio vendor: Google driver: snd_soc_skl v: kernel 
           bus-ID: 00:1f.3 
           Sound Server-1: ALSA v: k5.11.16-1 running: yes 
           Sound Server-2: JACK v: 1.9.18 running: no 
           Sound Server-3: PulseAudio v: 14.2 running: yes 
           Sound Server-4: PipeWire v: 0.3.28 running: no 
Network:   Device-1: Intel Wireless 7265 driver: iwlwifi v: kernel port: efa0 bus-ID: 01:00.0 
           IF: wlan0 state: up mac: <filter> 
Bluetooth: Device-1: Intel Bluetooth wireless interface type: USB driver: btusb v: 0.8 
           bus-ID: 1-3:3 
           Report: hciconfig ID: hci0 rfk-id: 0 state: up address: <filter> bt-v: 2.1 lmp-v: 4.2 
Drives:    Local Storage: total: 72.56 GiB used: 9.31 GiB (12.8%) 
           ID-1: /dev/mmcblk0 vendor: SanDisk model: DA4064 size: 58.24 GiB 
           ID-2: /dev/sda type: USB vendor: SanDisk model: Cruzer Snap size: 14.32 GiB 
Partition: ID-1: / size: 57.92 GiB used: 9.26 GiB (16.0%) fs: xfs dev: /dev/mmcblk0p2 
           ID-2: /boot size: 299.4 MiB used: 45.9 MiB (15.3%) fs: vfat dev: /dev/mmcblk0p1 
Swap:      Alert: No swap data was found. 
Sensors:   System Temperatures: cpu: 35.0 C mobo: N/A 
           Fan Speeds (RPM): N/A 
Info:      Processes: 181 Uptime: 1h 56m Memory: 3.74 GiB used: 2.02 GiB (53.9%) Init: systemd 
           runlevel: 5 Compilers: gcc: 10.3.0 Packages: 916 Client: Unknown Client: octopi 
           inxi: 3.3.04 


----------------------------------------------------------------------------------------------------------
journalctl -b -p err
----------------------------------------------------------------------------------------------------------

-- Journal begins at Thu 2021-06-03 16:33:28 CDT, ends at Thu 2021-06-03 18:29:19 CDT. --
Jun 03 16:33:29 Huxley kernel: cros-ec-typec GOOG0014:00: No port entries found.
Jun 03 16:33:32 Huxley kernel: snd_soc_skl 0000:00:1f.3: Fallback tplg fw dfw_sst.bin load failed with -2
Jun 03 16:33:32 Huxley kernel: snd_soc_skl 0000:00:1f.3: Failed to init topology!
Jun 03 16:33:32 Huxley kernel: snd_soc_skl 0000:00:1f.3: ASoC: error at snd_soc_component_probe on 0000:00:1f.3: -2
Jun 03 16:33:32 Huxley kernel: snd_soc_skl 0000:00:1f.3: ASoC: failed to probe component -2
Jun 03 16:33:32 Huxley kernel: kbl_da7219_max98_927_373 kbl_da7219_max98927: ASoC: failed to instantiate card -2
Jun 03 17:50:56 Huxley kernel: HDMI HDA Codec ehdaudio0D2: hdac_hdmi_present_sense: disconnect for pin:port 5:0
Jun 03 17:50:56 Huxley kernel: HDMI HDA Codec ehdaudio0D2: hdac_hdmi_present_sense: disconnect for pin:port 6:0
Jun 03 17:50:56 Huxley kernel: HDMI HDA Codec ehdaudio0D2: hdac_hdmi_present_sense: disconnect for pin:port 7:0
Jun 03 17:53:15 Huxley ntpd[372]: bind(24) AF_INET6 2600:6c42:7600:500:f8c8:53b8:caf7:294f#123 flags 0x11 failed: Cannot assign requested address
Jun 03 17:53:15 Huxley ntpd[372]: unable to create socket on wlan0 (8) for 2600:6c42:7600:500:f8c8:53b8:caf7:294f#123
Jun 03 18:17:18 Huxley systemd-coredump[5046]: Process 4783 (systemsettings5) of user 1000 dumped core.


----------------------------------------------------------------------------------------------------------
cat /etc/pacman.conf
----------------------------------------------------------------------------------------------------------

#
# /etc/pacman.conf
#
# See the pacman.conf(5) manpage for option and repository directives

#
# GENERAL OPTIONS
#
[options]
# The following paths are commented out with their default values listed.
# If you wish to use different paths, uncomment and update the paths.
#RootDir     = /
#DBPath      = /var/lib/pacman/
#CacheDir    = /var/cache/pacman/pkg/
#LogFile     = /var/log/pacman.log
#HookDir     = /etc/pacman.d/hooks/
HoldPkg     = pacman glibc
#XferCommand = /usr/bin/wget --passive-ftp -c -O %o %u
#XferCommand = /usr/bin/curl -L -C - -f -o %o %u
#CleanMethod = KeepInstalled
Architecture = auto

# Pacman won't upgrade packages listed in IgnorePkg and members of IgnoreGroup
#IgnorePkg   =
#IgnoreGroup =

#NoUpgrade   =
#NoExtract   =

# Misc options (all disabled by default)
#UseSyslog
#ShowSize
Color
#TotalDownload
CheckSpace
VerbosePkgLists
ILoveCandy

# By default, pacman accepts packages signed by keys that its local keyring
# trusts (see pacman-key and its man page), as well as unsigned packages.
SigLevel = Never
LocalFileSigLevel = Never
#RemoteFileSigLevel = Required

#
# REPOSITORIES
#   - can be defined here or included from another file
#   - pacman will search repositories in the order defined here
#   - local/custom mirrors can be added here or in separate files
#   - repositories listed first will take precedence when packages
#     have identical names, regardless of version number
#   - URLs will have $repo replaced by the name of the current repo
#   - URLs will have $arch replaced by the name of the architecture
#
# Repository entries are of the format:
#       [repo-name]
#       Server = ServerName
#       Include = IncludePath
#
# The header [repo-name] is crucial - it must be present and
# uncommented to enable the repo.
#

[core]
Include = /etc/pacman.d/mirrorlist

[main]
Include = /etc/pacman.d/mirrorlist

[apps]
Include = /etc/pacman.d/mirrorlist

# An example of a custom package repository.  See the pacman manpage for
# tips on creating your own repositories.
#[custom]
#Server = file:///home/custompkgs


----------------------------------------------------------------------------------------------------------
pacman -Qm
----------------------------------------------------------------------------------------------------------



----------------------------------------------------------------------------------------------------------
cat /var/log/pacman.log
----------------------------------------------------------------------------------------------------------

[2021-04-23T15:12:23+0000] [PACMAN] Running 'pacman -r work-x86_64/root-image -Syu --config pacman.conf -v'
[2021-04-23T15:12:23+0000] [PACMAN] synchronizing package lists
[2021-04-23T15:12:24+0000] [PACMAN] starting full system upgrade
[2021-04-23T15:12:28+0000] [ALPM] transaction started
[2021-04-23T15:12:28+0000] [ALPM] upgraded virtualbox-guest-utils (6.1.20-1 -> 6.1.20-2)
[2021-04-23T15:12:28+0000] [ALPM] transaction completed
[2021-04-23T15:19:14+0000] [PACMAN] Running 'pacman -r work-x86_64/root-image -R --config pacman.conf -v virtualbox-guest-utils'
[2021-04-23T15:19:15+0000] [ALPM] transaction started
[2021-04-23T15:19:15+0000] [ALPM] removed virtualbox-guest-utils (6.1.20-2)
[2021-04-23T15:19:15+0000] [ALPM] transaction completed
[2021-04-23T15:19:25+0000] [PACMAN] Running 'pacman -r work-x86_64/root-image -S --config pacman.conf -v virtualbox-guest-utils'
[2021-04-23T15:19:27+0000] [ALPM] transaction started
[2021-04-23T15:19:27+0000] [ALPM] installed virtualbox-guest-utils (6.1.20-2)
[2021-04-23T15:19:27+0000] [ALPM-SCRIPTLET] Created symlink /etc/systemd/system/multi-user.target.wants/vmsvga.service -> /usr/lib/systemd/system/vmsvga.service.
[2021-04-23T15:19:27+0000] [ALPM] transaction completed
[2021-06-03T16:28:52-0500] [PACMAN] Running 'pacman -R --noconfirm xf86-video-nouveau'
[2021-06-03T16:28:52-0500] [PACMAN] Running 'pacman -R --noconfirm xf86-video-amdgpu'
[2021-06-03T16:28:52-0500] [ALPM] transaction started
[2021-06-03T16:28:52-0500] [ALPM] removed xf86-video-amdgpu (19.1.0-1)
[2021-06-03T16:28:52-0500] [ALPM] transaction completed
[2021-06-03T16:28:52-0500] [PACMAN] Running 'pacman -R --noconfirm xf86-video-ati'
[2021-06-03T16:28:52-0500] [ALPM] transaction started
[2021-06-03T16:28:52-0500] [ALPM] removed xf86-video-ati (19.1.0-1)
[2021-06-03T16:28:52-0500] [ALPM] transaction completed
[2021-06-03T16:28:52-0500] [PACMAN] Running 'pacman -R --noconfirm xf86-video-vmware'
[2021-06-03T16:28:52-0500] [ALPM] transaction started
[2021-06-03T16:28:52-0500] [ALPM] removed xf86-video-vmware (13.3.0-10)
[2021-06-03T16:28:52-0500] [ALPM] transaction completed
[2021-06-03T16:28:52-0500] [PACMAN] Running 'pacman -Rncs --noconfirm xf86-input-wacom'
[2021-06-03T16:28:52-0500] [ALPM] transaction started
[2021-06-03T16:28:52-0500] [ALPM] removed wacomtablet (3.2.0-1)
[2021-06-03T16:28:52-0500] [ALPM] removed xf86-input-wacom (0.40.0-1)
[2021-06-03T16:28:52-0500] [ALPM] transaction completed
[2021-06-03T16:28:52-0500] [ALPM] running 'update-desktop-database.hook'...
[2021-06-03T16:28:53-0500] [PACMAN] Running 'pacman -Rns --noconfirm calamares calamares-debug console-setup'
[2021-06-03T16:28:53-0500] [ALPM] transaction started
[2021-06-03T16:28:53-0500] [ALPM] removed console-setup (1.202-1)
[2021-06-03T16:28:53-0500] [ALPM] removed calamares-debug (3.2.39.3-3)
[2021-06-03T16:28:53-0500] [ALPM] removed calamares (3.2.39.3-3)
[2021-06-03T16:28:53-0500] [ALPM] removed yaml-cpp (0.6.3-3)
[2021-06-03T16:28:53-0500] [ALPM] removed libpwquality (1.4.4-1)
[2021-06-03T16:28:53-0500] [ALPM] transaction completed
[2021-06-03T16:28:53-0500] [ALPM] running 'update-desktop-database.hook'...
[2021-06-03T16:28:53-0500] [PACMAN] Running 'pacman -Rns --noconfirm welcome'
[2021-06-03T16:28:53-0500] [ALPM] transaction started
[2021-06-03T16:28:53-0500] [ALPM] removed welcome (7.4-1)
[2021-06-03T16:28:53-0500] [ALPM] transaction completed
[2021-06-03T16:28:53-0500] [ALPM] running 'update-desktop-database.hook'...
[2021-06-03T16:28:53-0500] [PACMAN] Running 'pacman -Rns --noconfirm hardware-detection'
[2021-06-03T16:28:53-0500] [ALPM] transaction started
[2021-06-03T16:28:53-0500] [ALPM] removed hardware-detection (2021317-1)
[2021-06-03T16:28:53-0500] [ALPM] removed khd-nvidia-390xx (390.141-8)
[2021-06-03T16:28:53-0500] [ALPM] removed khd-nvidia (1:465.24.02-3)
[2021-06-03T16:28:53-0500] [ALPM] transaction completed
[2021-06-03T16:28:53-0500] [PACMAN] Running 'pacman -R --noconfirm init-live'
[2021-06-03T16:28:53-0500] [ALPM] transaction started
[2021-06-03T16:28:53-0500] [ALPM-SCRIPTLET] Disabling systemd service
[2021-06-03T16:28:53-0500] [ALPM-SCRIPTLET] Removed /etc/systemd/system/multi-user.target.wants/live.service.
[2021-06-03T16:28:53-0500] [ALPM] removed init-live (2020.03-1)
[2021-06-03T16:28:53-0500] [ALPM] transaction completed
[2021-06-03T16:28:53-0500] [PACMAN] Running 'pacman -Rncs --noconfirm grub'
[2021-06-03T16:28:53-0500] [ALPM] running 'texinfo-remove.hook'...
[2021-06-03T16:28:53-0500] [ALPM] transaction started
[2021-06-03T16:28:53-0500] [ALPM] removed grub2-editor (0.8.1-4)
[2021-06-03T16:28:53-0500] [ALPM] removed grub-theme-midna (3.2-1)
[2021-06-03T16:28:53-0500] [ALPM] removed grub (2.04-3)
[2021-06-03T16:28:53-0500] [ALPM] transaction completed
[2021-06-03T16:28:53-0500] [PACMAN] Running 'pacman -R --noconfirm virtualbox-guest-utils virtualbox-guest-modules'
[2021-06-03T16:28:53-0500] [ALPM] transaction started
[2021-06-03T16:28:53-0500] [ALPM] removed virtualbox-guest-utils (6.1.20-2)
[2021-06-03T16:28:53-0500] [ALPM] removed virtualbox-guest-modules (6.1.20-2)
[2021-06-03T16:28:53-0500] [ALPM-SCRIPTLET] Unloading modules: 
[2021-06-03T16:28:57-0500] [ALPM] transaction completed
[2021-06-03T17:53:36-0500] [PACMAN] Running '/usr/bin/pacman -Syu --noconfirm'
[2021-06-03T17:53:36-0500] [PACMAN] synchronizing package lists
[2021-06-03T17:53:38-0500] [PACMAN] starting full system upgrade
[2021-06-03T18:01:16-0500] [ALPM] transaction started
[2021-06-03T18:01:16-0500] [ALPM] upgraded readline (8.1.00-1 -> 8.1.001-1)
[2021-06-03T18:01:16-0500] [ALPM] upgraded bash (5.1.004-3 -> 5.1.008-1)
[2021-06-03T18:01:16-0500] [ALPM] upgraded zstd (1.4.9-1 -> 1.5.0-1)
[2021-06-03T18:01:16-0500] [ALPM] upgraded libtirpc (1.3.1-1 -> 1.3.2-1)
[2021-06-03T18:01:16-0500] [ALPM] upgraded libcap (2.49-1 -> 2.50-1)
[2021-06-03T18:01:18-0500] [ALPM] warning: directory permissions differ on /usr/lib/mysql/plugin/auth_pam_tool_dir/
filesystem: 700  package: 755
[2021-06-03T18:01:18-0500] [ALPM] upgraded mariadb (10.4.18-1 -> 10.4.19-1)
[2021-06-03T18:01:18-0500] [ALPM] upgraded libffi (3.3-3 -> 3.3-4)
[2021-06-03T18:01:19-0500] [ALPM] upgraded glib2 (2.66.7-1 -> 2.68.2-1)
[2021-06-03T18:01:19-0500] [ALPM] upgraded xorgproto (2021.3-1 -> 2021.4-1)
[2021-06-03T18:01:19-0500] [ALPM] upgraded libx11 (1.7.0-2 -> 1.7.1-1)
[2021-06-03T18:01:19-0500] [ALPM] upgraded libxfixes (5.0.3-3 -> 6.0.0-1)
[2021-06-03T18:01:19-0500] [ALPM] upgraded libxi (1.7.10-1 -> 1.7.10-2)
[2021-06-03T18:01:19-0500] [ALPM] upgraded libjpeg-turbo (2.0.6-1 -> 2.1.0-1)
[2021-06-03T18:01:19-0500] [ALPM] upgraded elfutils (0.183-1 -> 0.185-1)
[2021-06-03T18:01:19-0500] [ALPM] upgraded libdrm (2.4.105-1 -> 2.4.106-1)
[2021-06-03T18:01:19-0500] [ALPM] upgraded expat (2.3.0-1 -> 2.4.1-1)
[2021-06-03T18:01:19-0500] [ALPM] upgraded libglvnd (1.3.2-1 -> 1.3.3-1)
[2021-06-03T18:01:19-0500] [ALPM] upgraded libice (1.0.10-1 -> 1.0.10-2)
[2021-06-03T18:01:21-0500] [ALPM] upgraded mesa (21.0.3-1 -> 21.1.1-1)
[2021-06-03T18:01:21-0500] [ALPM] upgraded kmod (28-1 -> 29-1)
[2021-06-03T18:01:21-0500] [ALPM] upgraded libidn2 (2.3.0-1 -> 2.3.1-1)
[2021-06-03T18:01:21-0500] [ALPM] upgraded pcre2 (10.36-1 -> 10.37-1)
[2021-06-03T18:01:21-0500] [ALPM] upgraded libxml2 (2.9.10-2 -> 2.9.12-1)
[2021-06-03T18:01:21-0500] [ALPM] upgraded iana-etc (20210407-1 -> 20210514-1)
[2021-06-03T18:01:21-0500] [ALPM] upgraded device-mapper (2.02.187-4 -> 2.02.188-1)
[2021-06-03T18:01:22-0500] [ALPM] upgraded systemd (1:247.6-4 -> 1:248.3-1)
[2021-06-03T18:01:23-0500] [ALPM-SCRIPTLET] :: Updating bootctl
[2021-06-03T18:01:23-0500] [ALPM-SCRIPTLET] Copied "/usr/lib/systemd/boot/efi/systemd-bootx64.efi" to "/boot/EFI/systemd/systemd-bootx64.efi".
[2021-06-03T18:01:23-0500] [ALPM-SCRIPTLET] Copied "/usr/lib/systemd/boot/efi/systemd-bootx64.efi" to "/boot/EFI/BOOT/BOOTX64.EFI".
[2021-06-03T18:01:23-0500] [ALPM] upgraded wayland-protocols (1.20-1 -> 1.21-1)
[2021-06-03T18:01:23-0500] [ALPM] upgraded libxkbcommon (1.2.1-1 -> 1.3.0-1)
[2021-06-03T18:01:23-0500] [ALPM] upgraded libgudev (236-1 -> 236-2)
[2021-06-03T18:01:23-0500] [ALPM] upgraded libwacom (1.9-1 -> 1.10-1)
[2021-06-03T18:01:23-0500] [ALPM] upgraded libinput (1.17.1-1 -> 1.17.3-1)
[2021-06-03T18:01:23-0500] [ALPM] upgraded cairo (1.17.4-1 -> 1.17.4-2)
[2021-06-03T18:01:23-0500] [ALPM] upgraded harfbuzz (2.8.0-1 -> 2.8.1-1)
[2021-06-03T18:01:24-0500] [ALPM] upgraded python3 (3.8.9-1 -> 3.8.10-1)
[2021-06-03T18:01:25-0500] [ALPM] upgraded qt5-base (5.15.2-3 -> 5.15.2-4)
[2021-06-03T18:01:26-0500] [ALPM] upgraded kitemviews (5.81.0-3 -> 5.82.0-1)
[2021-06-03T18:01:26-0500] [ALPM] upgraded karchive (5.81.0-3 -> 5.82.0-1)
[2021-06-03T18:01:26-0500] [ALPM] upgraded kconfig (5.81.0-3 -> 5.82.0-1)
[2021-06-03T18:01:26-0500] [ALPM] upgraded kcoreaddons (5.81.0-4 -> 5.82.0-1)
[2021-06-03T18:01:26-0500] [ALPM] upgraded kwindowsystem (5.81.0-3 -> 5.82.0-1)
[2021-06-03T18:01:26-0500] [ALPM] upgraded kcrash (5.81.0-3 -> 5.82.0-1)
[2021-06-03T18:01:26-0500] [ALPM] upgraded kdbusaddons (5.81.0-3 -> 5.82.0-1)
[2021-06-03T18:01:26-0500] [ALPM] upgraded ki18n (5.81.0-3 -> 5.82.0-1)
[2021-06-03T18:01:26-0500] [ALPM] upgraded kservice (5.81.0-3 -> 5.82.0-1)
[2021-06-03T18:01:26-0500] [ALPM] upgraded lvm2 (2.02.187-4 -> 2.02.188-1)
[2021-06-03T18:01:26-0500] [ALPM] upgraded nspr (4.30-1 -> 4.31-1)
[2021-06-03T18:01:26-0500] [ALPM] upgraded nss (3.64-1 -> 3.66-1)
[2021-06-03T18:01:26-0500] [ALPM] upgraded btrfs-progs (5.11.1-1 -> 5.12.1-1)
[2021-06-03T18:01:26-0500] [ALPM] upgraded python3-six (1.15.0-2 -> 1.16.0-1)
[2021-06-03T18:01:26-0500] [ALPM] upgraded curl (7.76.1-3 -> 7.77.0-1)
[2021-06-03T18:01:26-0500] [ALPM] upgraded libtasn1 (4.16.0-1 -> 4.17.0-1)
[2021-06-03T18:01:27-0500] [ALPM] upgraded gnupg (2.2.27-1 -> 2.3.1-1)
[2021-06-03T18:01:27-0500] [ALPM] upgraded js (78.10.0-1 -> 78.10.1-1)
[2021-06-03T18:01:27-0500] [ALPM] upgraded solid (5.81.0-3 -> 5.82.0-1)
[2021-06-03T18:01:27-0500] [ALPM] upgraded kglobalaccel (5.81.0-3 -> 5.82.0-1)
[2021-06-03T18:01:27-0500] [ALPM] upgraded kwidgetsaddons (5.81.0-3 -> 5.82.0-1)
[2021-06-03T18:01:27-0500] [ALPM] upgraded kcompletion (5.81.0-3 -> 5.82.0-1)
[2021-06-03T18:01:27-0500] [ALPM] upgraded qt5-svg (5.15.2-2 -> 5.15.2-3)
[2021-06-03T18:01:27-0500] [ALPM] upgraded kauth (5.81.0-3 -> 5.82.0-1)
[2021-06-03T18:01:27-0500] [ALPM] upgraded kcodecs (5.81.0-3 -> 5.82.0-1)
[2021-06-03T18:01:28-0500] [ALPM] upgraded qt5-wayland (5.15.2-2 -> 5.15.2-3)
[2021-06-03T18:01:28-0500] [ALPM] upgraded kguiaddons (5.81.0-3 -> 5.82.0-1)
[2021-06-03T18:01:28-0500] [ALPM] upgraded kconfigwidgets (5.81.0-3 -> 5.82.0-1)
[2021-06-03T18:01:28-0500] [ALPM] upgraded kiconthemes (5.81.0-3 -> 5.82.0-1)
[2021-06-03T18:01:28-0500] [ALPM] upgraded sonnet (5.81.0-3 -> 5.82.0-1)
[2021-06-03T18:01:28-0500] [ALPM] upgraded pango (1.48.4-1 -> 1.48.5-1)
[2021-06-03T18:01:28-0500] [ALPM] upgraded x265 (3.5-1 -> 3.5-2)
[2021-06-03T18:01:28-0500] [ALPM] upgraded libass (0.15.0-1 -> 0.15.1-1)
[2021-06-03T18:01:28-0500] [ALPM] upgraded libsigc++ (2.10.6-1 -> 2.10.7-1)
[2021-06-03T18:01:28-0500] [ALPM] upgraded glibmm (2.66.0-1 -> 2.66.1-1)
[2021-06-03T18:01:28-0500] [ALPM] upgraded libxml++ (3.2.2-1 -> 3.2.3-1)
[2021-06-03T18:01:28-0500] [ALPM] upgraded fluidsynth (2.2.0-1 -> 2.2.1-1)
[2021-06-03T18:01:28-0500] [ALPM] upgraded gdk-pixbuf2 (2.42.6-1 -> 2.42.6-2)
[2021-06-03T18:01:28-0500] [ALPM] upgraded libcroco (0.6.13-5 -> 0.6.13-6)
[2021-06-03T18:01:28-0500] [ALPM] upgraded librsvg (2.50.4-3 -> 2.50.6-1)
[2021-06-03T18:01:28-0500] [ALPM] upgraded libmms (0.6.4-13 -> 0.6.4-14)
[2021-06-03T18:01:28-0500] [ALPM] upgraded mpg123 (1.26.5-1 -> 1.27.2-1)
[2021-06-03T18:01:28-0500] [ALPM] upgraded vulkan-loader (1.2.176-1 -> 1.2.179-1)
[2021-06-03T18:01:28-0500] [ALPM] upgraded vulkan-headers (1.2.176-1 -> 1.2.179-1)
[2021-06-03T18:01:29-0500] [ALPM] upgraded vulkan-validationlayers (1.2.176-1 -> 1.2.179-1)
[2021-06-03T18:01:29-0500] [ALPM] upgraded dav1d (0.8.2-1 -> 0.9.0-1)
[2021-06-03T18:01:29-0500] [ALPM] upgraded gobject-introspection (1.66.1-1 -> 1.68.0-1)
[2021-06-03T18:01:29-0500] [ALPM] upgraded python3-gobject3 (3.38.0-1 -> 3.40.1-1)
[2021-06-03T18:01:30-0500] [ALPM] upgraded samba (4.14.3-1 -> 4.14.4-1)
[2021-06-03T18:01:31-0500] [ALPM] upgraded ffmpeg (4.3.2-4 -> 4.3.2-5)
[2021-06-03T18:01:31-0500] [ALPM] upgraded ktextwidgets (5.81.0-3 -> 5.82.0-1)
[2021-06-03T18:01:31-0500] [ALPM] upgraded kf5-attica (5.81.0-3 -> 5.82.0-1)
[2021-06-03T18:01:31-0500] [ALPM] upgraded kxmlgui (5.81.0-3 -> 5.82.0-1)
[2021-06-03T18:01:31-0500] [ALPM] upgraded kbookmarks (5.81.0-3 -> 5.82.0-1)
[2021-06-03T18:01:31-0500] [ALPM] upgraded kjobwidgets (5.81.0-3 -> 5.82.0-1)
[2021-06-03T18:01:31-0500] [ALPM] upgraded knotifications (5.81.0-3 -> 5.82.0-1)
[2021-06-03T18:01:31-0500] [ALPM] upgraded kwallet (5.81.0-3 -> 5.82.0-1)
[2021-06-03T18:01:32-0500] [ALPM] upgraded kio (5.81.0-3 -> 5.82.0-3)
[2021-06-03T18:01:32-0500] [ALPM] upgraded kplotting (5.81.0-3 -> 5.82.0-1)
[2021-06-03T18:01:32-0500] [ALPM] upgraded kdesignerplugin (5.81.0-3 -> 5.82.0-1)
[2021-06-03T18:01:32-0500] [ALPM] upgraded kitemmodels (5.81.0-3 -> 5.82.0-1)
[2021-06-03T18:01:32-0500] [ALPM] upgraded kpackage (5.81.0-3 -> 5.82.0-1)
[2021-06-03T18:01:32-0500] [ALPM] upgraded libepoxy (1.5.5-1 -> 1.5.8-1)
[2021-06-03T18:01:32-0500] [ALPM] upgraded kdeclarative (5.81.0-3 -> 5.82.0-1)
[2021-06-03T18:01:32-0500] [ALPM] upgraded kcmutils (5.81.0-3 -> 5.82.0-1)
[2021-06-03T18:01:32-0500] [ALPM] upgraded kaccounts-integration (21.04.0-1 -> 21.04.1-1)
[2021-06-03T18:01:32-0500] [ALPM] upgraded akonadi (21.04.0-1 -> 21.04.1-1)
[2021-06-03T18:01:33-0500] [ALPM] upgraded kirigami (5.81.0-3 -> 5.82.0-1)
[2021-06-03T18:01:33-0500] [ALPM] upgraded knewstuff (5.81.0-3 -> 5.82.0-1)
[2021-06-03T18:01:33-0500] [ALPM] upgraded grantleetheme (21.04.0-1 -> 21.04.1-1)
[2021-06-03T18:01:33-0500] [ALPM] upgraded kcontacts (1:5.81.0-3 -> 1:5.82.0-1)
[2021-06-03T18:01:33-0500] [ALPM] upgraded kcalendarcore (5.81.0-3 -> 5.82.0-1)
[2021-06-03T18:01:33-0500] [ALPM] upgraded kmime (21.04.0-1 -> 21.04.1-1)
[2021-06-03T18:01:33-0500] [ALPM] upgraded akonadi-mime (21.04.0-1 -> 21.04.1-1)
[2021-06-03T18:01:34-0500] [ALPM] upgraded kemoticons (5.81.0-3 -> 5.82.0-1)
[2021-06-03T18:01:34-0500] [ALPM] upgraded syntax-highlighting (5.81.0-3 -> 5.82.0-1)
[2021-06-03T18:01:34-0500] [ALPM] upgraded kpimtextedit (21.04.0-1 -> 21.04.1-1)
[2021-06-03T18:01:34-0500] [ALPM] upgraded libkleo (21.04.0-1 -> 21.04.1-1)
[2021-06-03T18:01:34-0500] [ALPM] upgraded prison (5.81.0-3 -> 5.82.0-1)
[2021-06-03T18:01:34-0500] [ALPM] upgraded protobuf (3.15.8-2 -> 3.17.1-1)
[2021-06-03T18:01:36-0500] [ALPM] upgraded qtwebengine (5.15.3-3 -> 5.15.4-2)
[2021-06-03T18:01:36-0500] [ALPM] upgraded akonadi-contacts (21.04.0-1 -> 21.04.1-1)
[2021-06-03T18:01:36-0500] [ALPM] upgraded kpty (5.81.0-3 -> 5.82.0-1)
[2021-06-03T18:01:36-0500] [ALPM] upgraded kparts (5.81.0-3 -> 5.82.0-1)
[2021-06-03T18:01:36-0500] [ALPM] upgraded unrar (6.0.5-2 -> 6.0.6-1)
[2021-06-03T18:01:37-0500] [ALPM] upgraded ark (21.04.0-1 -> 21.04.1-1)
[2021-06-03T18:01:38-0500] [ALPM] upgraded qt6-base (6.1.0rc-1 -> 6.1.0-1)
[2021-06-03T18:01:38-0500] [ALPM] upgraded poppler (21.04.0-1 -> 21.05.0-1)
[2021-06-03T18:01:38-0500] [ALPM] upgraded kfilemetadata (5.81.0-3 -> 5.82.0-2)
[2021-06-03T18:01:38-0500] [ALPM] upgraded kidletime (5.81.0-3 -> 5.82.0-1)
[2021-06-03T18:01:38-0500] [ALPM] upgraded baloo (5.81.0-3 -> 5.82.0-1)
[2021-06-03T18:01:38-0500] [ALPM] upgraded baloo-widgets (21.04.0-1 -> 21.04.1-1)
[2021-06-03T18:01:38-0500] [ALPM] upgraded bluez-qt (5.81.0-3 -> 5.82.0-1)
[2021-06-03T18:01:38-0500] [ALPM] upgraded kinit (5.81.0-3 -> 5.82.0-1)
[2021-06-03T18:01:38-0500] [ALPM] upgraded kactivities (5.81.0-3 -> 5.82.0-1)
[2021-06-03T18:01:38-0500] [ALPM] upgraded plasma-wayland-protocols (1.2.1-1 -> 1.3.0-1)
[2021-06-03T18:01:38-0500] [ALPM] upgraded kwayland (5.81.0-4 -> 5.82.0-1)
[2021-06-03T18:01:38-0500] [ALPM] upgraded plasma-framework (5.81.0-3 -> 5.82.0-1)
[2021-06-03T18:01:39-0500] [ALPM] upgraded kded (5.81.0-3 -> 5.82.0-1)
[2021-06-03T18:01:39-0500] [ALPM] upgraded bluedevil (5.21.4-1 -> 5.21.5-1)
[2021-06-03T18:01:39-0500] [ALPM] upgraded kdecoration (5.21.4-1 -> 5.21.5-1)
[2021-06-03T18:01:39-0500] [ALPM] upgraded xorg-fonts-encodings (1.0.5-1 -> 1.0.5-2)
[2021-06-03T18:01:39-0500] [ALPM] upgraded frameworkintegration (5.81.0-3 -> 5.82.0-1)
[2021-06-03T18:01:41-0500] [ALPM] upgraded breeze-icons (5.81.0-2 -> 5.82.0-1)
[2021-06-03T18:01:42-0500] [ALPM] upgraded breeze (5.21.4-1 -> 5.21.5-1)
[2021-06-03T18:01:42-0500] [ALPM] upgraded breeze-gtk (5.21.4-1 -> 5.21.5-1)
[2021-06-03T18:01:42-0500] [ALPM] upgraded qpdf (10.3.1-1 -> 10.3.2-1)
[2021-06-03T18:01:43-0500] [ALPM] upgraded cups-filters (1.28.8-2 -> 1.28.8-3)
[2021-06-03T18:01:43-0500] [ALPM] upgraded dconf (0.40.0-1 -> 0.40.0-2)
[2021-06-03T18:01:43-0500] [ALPM] upgraded dialog (1:1.3_20210324-1 -> 1:1.3_202103509-1)
[2021-06-03T18:01:43-0500] [ALPM] upgraded dnsutils (9.16.13-1 -> 9.16.16-1)
[2021-06-03T18:01:43-0500] [ALPM] upgraded kdesu (5.81.0-3 -> 5.82.0-1)
[2021-06-03T18:01:43-0500] [ALPM] upgraded knotifyconfig (5.81.0-3 -> 5.82.0-1)
[2021-06-03T18:01:43-0500] [ALPM] upgraded threadweaver (5.81.0-3 -> 5.82.0-1)
[2021-06-03T18:01:43-0500] [ALPM] upgraded krunner (5.81.0-3 -> 5.82.0-1)
[2021-06-03T18:01:43-0500] [ALPM] upgraded kunitconversion (5.81.0-3 -> 5.82.0-1)
[2021-06-03T18:01:44-0500] [ALPM] upgraded iproute2 (5.11.0-1 -> 5.12.0-1)
[2021-06-03T18:01:44-0500] [ALPM] upgraded iwd (1.13-1 -> 1.14-1)
[2021-06-03T18:01:44-0500] [ALPM] upgraded libndp (1.7-2 -> 1.8-1)
[2021-06-03T18:01:44-0500] [ALPM] upgraded libmbim (1.24.6-1 -> 1.24.6-2)
[2021-06-03T18:01:44-0500] [ALPM] upgraded libqmi (1.28.2-1 -> 1.28.4-1)
[2021-06-03T18:01:44-0500] [ALPM] upgraded libsodium (1.0.18-1 -> 1.0.18-2)
[2021-06-03T18:01:45-0500] [ALPM] upgraded kdelibs4support (5.81.0-3 -> 5.82.0-1)
[2021-06-03T18:01:45-0500] [ALPM] upgraded kwayland-server (5.21.4-1 -> 5.21.5-1)
[2021-06-03T18:01:45-0500] [ALPM] upgraded kscreenlocker (5.21.4-1 -> 5.21.5-1)
[2021-06-03T18:01:45-0500] [ALPM] installed libqaccessibilityclient (0.4.1-3)
[2021-06-03T18:01:45-0500] [ALPM] upgraded pipewire (0.3.26-1 -> 0.3.28-1)
[2021-06-03T18:01:46-0500] [ALPM] upgraded kwin (5.21.4-1 -> 5.21.5-2)
[2021-06-03T18:01:46-0500] [ALPM] upgraded libksysguard (5.21.4-1 -> 5.21.5-1)
[2021-06-03T18:01:46-0500] [ALPM] upgraded ktexteditor (5.81.0-3 -> 5.82.0-1)
[2021-06-03T18:01:47-0500] [ALPM] upgraded kjs (5.81.0-3 -> 5.82.0-1)
[2021-06-03T18:01:47-0500] [ALPM] upgraded khtml (5.81.0-3 -> 5.82.0-1)
[2021-06-03T18:01:47-0500] [ALPM] upgraded khelpcenter (21.04.0-1 -> 21.04.1-1)
[2021-06-03T18:01:47-0500] [ALPM] upgraded kdnssd (5.81.0-3 -> 5.82.0-1)
[2021-06-03T18:01:47-0500] [ALPM] upgraded kactivities-stats (5.81.0-3 -> 5.82.0-1)
[2021-06-03T18:01:48-0500] [ALPM] upgraded openexr (2.5.5-1 -> 2.5.6-1)
[2021-06-03T18:01:48-0500] [ALPM] upgraded kio-extras (21.04.0-1 -> 21.04.1-1)
[2021-06-03T18:01:48-0500] [ALPM] upgraded milou (5.21.4-1 -> 5.21.5-1)
[2021-06-03T18:01:48-0500] [ALPM] upgraded libkscreen (5.21.4-1 -> 5.21.5-1)
[2021-06-03T18:01:48-0500] [ALPM] upgraded libqalculate (3.18.0-1 -> 3.19.0-1)
[2021-06-03T18:01:50-0500] [ALPM] upgraded oxygen-icons5 (5.81.0-2 -> 5.82.0-1)
[2021-06-03T18:01:50-0500] [ALPM] upgraded sddm-kcm (1:5.21.4-1 -> 1:5.21.5-1)
[2021-06-03T18:01:50-0500] [ALPM] upgraded networkmanager-qt (5.81.0-3 -> 5.82.0-1)
[2021-06-03T18:01:50-0500] [ALPM] upgraded kxmlrpcclient (1:5.81.0-3 -> 1:5.82.0-1)
[2021-06-03T18:01:51-0500] [ALPM] upgraded kactivitymanagerd (5.21.4-1 -> 5.21.5-1)
[2021-06-03T18:01:51-0500] [ALPM] upgraded kpeople (5.81.0-3 -> 5.82.0-1)
[2021-06-03T18:01:51-0500] [ALPM] upgraded kholidays (1:5.81.0-3 -> 1:5.82.0-1)
[2021-06-03T18:01:51-0500] [ALPM] upgraded drkonqi (5.21.4-1 -> 5.21.5-1)
[2021-06-03T18:01:51-0500] [ALPM] upgraded kquickcharts (5.81.0-3 -> 5.82.0-2)
[2021-06-03T18:01:51-0500] [ALPM] upgraded kwayland-integration (5.21.4-1 -> 5.21.5-1)
[2021-06-03T18:01:53-0500] [ALPM] upgraded plasma-workspace (5.21.4-1 -> 5.21.5-1)
[2021-06-03T18:01:53-0500] [ALPM] upgraded kde-cli-tools (5.21.4-1 -> 5.21.5-1)
[2021-06-03T18:01:53-0500] [ALPM] upgraded dolphin (21.04.0-1 -> 21.04.1-1)
[2021-06-03T18:01:53-0500] [ALPM] upgraded dolphin-plugins (21.04.0-1 -> 21.04.1-1)
[2021-06-03T18:01:53-0500] [ALPM] upgraded elisa (21.04.0-1 -> 21.04.1-1)
[2021-06-03T18:01:53-0500] [ALPM] upgraded libgusb (0.3.6-1 -> 0.3.7-1)
[2021-06-03T18:01:53-0500] [ALPM] upgraded net-snmp (5.9-2 -> 5.9.1-1)
[2021-06-03T18:01:53-0500] [ALPM] upgraded libidn (1.36-1 -> 1.37-1)
[2021-06-03T18:01:54-0500] [ALPM] upgraded epson-inkjet-printer-escpr (1.7.9-1 -> 1.7.10-1)
[2021-06-03T18:01:54-0500] [ALPM] upgraded ffmpegthumbs (21.04.0-1 -> 21.04.1-1)
[2021-06-03T18:01:54-0500] [ALPM] upgraded guile (2.2.7-2 -> 2.2.7-3)
[2021-06-03T18:01:54-0500] [ALPM] upgraded gdb (10.1-2 -> 10.2-1)
[2021-06-03T18:01:54-0500] [ALPM] upgraded glib-networking (2.66.0-3 -> 2.68.1-1)
[2021-06-03T18:01:54-0500] [ALPM] upgraded gsettings-desktop-schemas (3.38.0-1 -> 40.0-1)
[2021-06-03T18:01:55-0500] [ALPM] upgraded kimageformats (5.81.0-3 -> 5.82.0-2)
[2021-06-03T18:01:55-0500] [ALPM] upgraded libkdcraw (21.04.0-1 -> 21.04.1-1)
[2021-06-03T18:01:55-0500] [ALPM] upgraded libkipi (21.04.0-1 -> 21.04.1-1)
[2021-06-03T18:01:55-0500] [ALPM] upgraded libkexiv2 (21.04.0-1 -> 21.04.1-1)
[2021-06-03T18:01:55-0500] [ALPM] upgraded kdewebkit (5.81.0-3 -> 5.82.0-1)
[2021-06-03T18:01:55-0500] [ALPM] upgraded kipi-plugins (21.04.0-1 -> 21.04.1-1)
[2021-06-03T18:01:56-0500] [ALPM] upgraded gwenview (21.04.0-1 -> 21.04.1-1)
[2021-06-03T18:01:56-0500] [ALPM] upgraded hdparm (9.60-1 -> 9.62-1)
[2021-06-03T18:01:56-0500] [ALPM] upgraded python3-setuptools (56.0.0-1 -> 57.0.0-1)
[2021-06-03T18:01:57-0500] [ALPM] upgraded hplip (3.21.2-2 -> 3.21.4-1)
[2021-06-03T18:01:57-0500] [ALPM-SCRIPTLET] 
[2021-06-03T18:01:57-0500] [ALPM-SCRIPTLET] NOTE
[2021-06-03T18:01:57-0500] [ALPM-SCRIPTLET] ----
[2021-06-03T18:01:57-0500] [ALPM-SCRIPTLET] # If you want to use this driver with your HP scanner,
[2021-06-03T18:01:57-0500] [ALPM-SCRIPTLET] # make sure hpaio is part of /etc/sane.d/dll.conf, if not:
[2021-06-03T18:01:57-0500] [ALPM-SCRIPTLET] #  echo "hpaio" >> /etc/sane.d/dll.conf
[2021-06-03T18:01:57-0500] [ALPM-SCRIPTLET] 
[2021-06-03T18:01:57-0500] [ALPM] upgraded hwinfo (21.72-1 -> 21.74-1)
[2021-06-03T18:01:57-0500] [ALPM] upgraded liblqr (0.4.2-15 -> 0.4.2-16)
[2021-06-03T18:01:57-0500] [ALPM] upgraded imagemagick (6.9.12.8-1 -> 6.9.12.13-1)
[2021-06-03T18:01:57-0500] [ALPM] upgraded libkcddb5 (21.04.0-1 -> 21.04.1-1)
[2021-06-03T18:01:58-0500] [ALPM] upgraded k3b (1:21.04.0-1 -> 1:21.04.1-1)
[2021-06-03T18:01:58-0500] [ALPM] upgraded kaccounts-providers (21.04.0-1 -> 21.04.1-1)
[2021-06-03T18:01:58-0500] [ALPM] upgraded pulseaudio-qt (1.2-1 -> 1.3-1)
[2021-06-03T18:01:58-0500] [ALPM] upgraded kdeconnect-kde (1:21.04.0-1 -> 1:21.04.1-2)
[2021-06-03T18:01:58-0500] [ALPM] upgraded purpose (5.81.0-3 -> 5.82.0-1)
[2021-06-03T18:01:58-0500] [ALPM] upgraded kamoso (21.04.0-1 -> 21.04.1-1)
[2021-06-03T18:01:58-0500] [ALPM] upgraded python3-markupsafe (1.1.1-2 -> 2.0.1-1)
[2021-06-03T18:01:59-0500] [ALPM] upgraded python3-jinja (2.11.3-1 -> 3.0.1-1)
[2021-06-03T18:01:59-0500] [ALPM] upgraded kapidox (5.81.0-3 -> 5.82.0-1)
[2021-06-03T18:01:59-0500] [ALPM] upgraded kate (21.04.0-1 -> 21.04.1-1)
[2021-06-03T18:02:00-0500] [ALPM] upgraded kcharselect (21.04.0-1 -> 21.04.1-1)
[2021-06-03T18:02:00-0500] [ALPM] upgraded kcolorpicker (0.1.5-1 -> 0.1.6-1)
[2021-06-03T18:02:00-0500] [ALPM] upgraded kde-gtk-config (5.21.4-1 -> 5.21.5-1)
[2021-06-03T18:02:00-0500] [ALPM] upgraded kdegraphics-mobipocket (21.04.0-1 -> 21.04.1-1)
[2021-06-03T18:02:00-0500] [ALPM] upgraded kdegraphics-thumbnailers (21.04.0-1 -> 21.04.1-1)
[2021-06-03T18:02:00-0500] [ALPM] upgraded kross (5.81.0-3 -> 5.82.0-1)
[2021-06-03T18:02:00-0500] [ALPM] upgraded kdeplasma-addons (5.21.4-1 -> 5.21.5-1)
[2021-06-03T18:02:00-0500] [ALPM] upgraded kdesdk-thumbnailers (21.04.0-1 -> 21.04.1-1)
[2021-06-03T18:02:00-0500] [ALPM] upgraded kdialog (21.04.0-1 -> 21.04.1-1)
[2021-06-03T18:02:00-0500] [ALPM-SCRIPTLET]  The kde-baseapps package is split into 4 new packages
[2021-06-03T18:02:00-0500] [ALPM-SCRIPTLET]  besides kdialog, install the other components you wish to keep:
[2021-06-03T18:02:00-0500] [ALPM-SCRIPTLET]  sudo pacman -S kfind
[2021-06-03T18:02:00-0500] [ALPM-SCRIPTLET]  sudo pacman -S keditbookmarks
[2021-06-03T18:02:00-0500] [ALPM-SCRIPTLET]  sudo pacman -S konqueror 
[2021-06-03T18:02:01-0500] [ALPM] upgraded kdoctools (5.81.0-3 -> 5.82.0-1)
[2021-06-03T18:02:01-0500] [ALPM] upgraded keditbookmarks (21.04.0-1 -> 21.04.1-1)
[2021-06-03T18:02:01-0500] [ALPM] upgraded kfind (21.04.0-1 -> 21.04.1-1)
[2021-06-03T18:02:01-0500] [ALPM] upgraded libktorrent (21.04.0-1 -> 21.04.1-1)
[2021-06-03T18:02:01-0500] [ALPM] upgraded kget (21.04.0-1 -> 21.04.1-1)
[2021-06-03T18:02:01-0500] [ALPM] upgraded kgpg (21.04.0-1 -> 21.04.1-1)
[2021-06-03T18:02:02-0500] [ALPM] upgraded khotkeys (5.21.4-1 -> 5.21.5-1)
[2021-06-03T18:02:02-0500] [ALPM] upgraded kimageannotator (0.4.2-1 -> 0.5.1-1)
[2021-06-03T18:02:02-0500] [ALPM] upgraded kinfocenter (5.21.4-1 -> 5.21.5-1)
[2021-06-03T18:02:02-0500] [ALPM] upgraded kjsembed (5.81.0-3 -> 5.82.0-1)
[2021-06-03T18:02:02-0500] [ALPM] upgraded kmediaplayer (5.81.0-3 -> 5.82.0-1)
[2021-06-03T18:02:02-0500] [ALPM] upgraded kmenuedit (5.21.4-1 -> 5.21.5-1)
[2021-06-03T18:02:02-0500] [ALPM] upgraded libkomparediff2 (21.04.0-1 -> 21.04.1-1)
[2021-06-03T18:02:02-0500] [ALPM] upgraded kompare (21.04.0-1 -> 21.04.1-1)
[2021-06-03T18:02:02-0500] [ALPM] upgraded konsole (21.04.0-1 -> 21.04.1-1)
[2021-06-03T18:02:03-0500] [ALPM] upgraded libkdegames (21.04.0-1 -> 21.04.1-1)
[2021-06-03T18:02:03-0500] [ALPM] upgraded kpat (21.04.0-1 -> 21.04.1-1)
[2021-06-03T18:02:03-0500] [ALPM] upgraded kpmcore (21.04.0-1 -> 21.04.1-1)
[2021-06-03T18:02:04-0500] [ALPM] upgraded kpmcore-debug (21.04.0-1 -> 21.04.1-1)
[2021-06-03T18:02:04-0500] [ALPM] upgraded kscreen (5.21.4-1 -> 5.21.5-1)
[2021-06-03T18:02:04-0500] [ALPM] upgraded ksshaskpass (5.21.4-1 -> 5.21.5-1)
[2021-06-03T18:02:04-0500] [ALPM] upgraded ksysguard (5.21.4-1 -> 5.21.5-1)
[2021-06-03T18:02:04-0500] [ALPM] upgraded ktp-common-internals (21.04.0-1 -> 21.04.1-1)
[2021-06-03T18:02:04-0500] [ALPM] upgraded libsoup (2.72.0-1 -> 2.72.0-2)
[2021-06-03T18:02:04-0500] [ALPM] upgraded libpurple (2.14.3-1 -> 2.14.4-1)
[2021-06-03T18:02:05-0500] [ALPM] upgraded ktp-accounts-kcm (21.04.0-1 -> 21.04.1-1)
[2021-06-03T18:02:05-0500] [ALPM] upgraded ktp-approver (21.04.0-1 -> 21.04.1-1)
[2021-06-03T18:02:05-0500] [ALPM] upgraded signon-kwallet-extension (21.04.0-1 -> 21.04.1-1)
[2021-06-03T18:02:05-0500] [ALPM] upgraded ktp-auth-handler (21.04.0-1 -> 21.04.1-1)
[2021-06-03T18:02:05-0500] [ALPM] upgraded ktp-call-ui (21.04.0-1 -> 21.04.1-1)
[2021-06-03T18:02:05-0500] [ALPM] upgraded ktp-contact-list (21.04.0-1 -> 21.04.1-1)
[2021-06-03T18:02:05-0500] [ALPM] upgraded ktp-contact-runner (21.04.0-1 -> 21.04.1-1)
[2021-06-03T18:02:05-0500] [ALPM] upgraded ktp-desktop-applets (21.04.0-1 -> 21.04.1-1)
[2021-06-03T18:02:05-0500] [ALPM] upgraded ktp-filetransfer-handler (21.04.0-1 -> 21.04.1-1)
[2021-06-03T18:02:05-0500] [ALPM] upgraded ktp-kded-module (21.04.0-1 -> 21.04.1-1)
[2021-06-03T18:02:05-0500] [ALPM] upgraded ktp-send-file (21.04.0-1 -> 21.04.1-1)
[2021-06-03T18:02:05-0500] [ALPM] upgraded ktp-text-ui (21.04.0-1 -> 21.04.1-1)
[2021-06-03T18:02:05-0500] [ALPM] upgraded kvantum (0.19.0-1 -> 0.20.0-1)
[2021-06-03T18:02:05-0500] [ALPM] upgraded kwallet-pam (5.21.4-1 -> 5.21.5-1)
[2021-06-03T18:02:05-0500] [ALPM] upgraded kwalletmanager (21.04.0-1 -> 21.04.1-1)
[2021-06-03T18:02:05-0500] [ALPM] upgraded less (581-1 -> 581.2-1)
[2021-06-03T18:02:05-0500] [ALPM] upgraded libcdio (2.1.0-1 -> 2.1.0-2)
[2021-06-03T18:02:05-0500] [ALPM] upgraded libetonyek (0.1.9-8 -> 0.1.10-1)
[2021-06-03T18:02:05-0500] [ALPM] upgraded postgresql-libs (1:13.2-1 -> 1:13.3-1)
[2021-06-03T18:02:06-0500] [ALPM] upgraded redland (1.0.17-8 -> 1.0.17-9)
[2021-06-03T18:02:06-0500] [ALPM] upgraded translate-toolkit (3.3.4-1 -> 3.3.6-1)
[2021-06-03T18:02:06-0500] [ALPM] upgraded ttf-liberation (2.1.3-1 -> 2.1.4-1)
[2021-06-03T18:02:12-0500] [ALPM-SCRIPTLET] Updating font cache... done.
[2021-06-03T18:02:17-0500] [ALPM] upgraded libreoffice (7.1.2.2-2 -> 7.1.3.2-2)
[2021-06-03T18:02:23-0500] [ALPM] upgraded linux-firmware (20210423-1 -> 20210511-1)
[2021-06-03T18:02:23-0500] [ALPM] upgraded logrotate (3.18.0-4 -> 3.18.1-1)
[2021-06-03T18:02:23-0500] [ALPM] upgraded micro (2.0.8-1 -> 2.0.9-1)
[2021-06-03T18:02:23-0500] [ALPM] upgraded mkinitcpio-busybox (1.32.1-1 -> 1.33.1-1)
[2021-06-03T18:02:23-0500] [ALPM] upgraded modemmanager-qt (5.81.0-3 -> 5.82.0-1)
[2021-06-03T18:02:23-0500] [ALPM] upgraded nano (5.6.1-4 -> 5.7-1)
[2021-06-03T18:02:23-0500] [ALPM] upgraded netctl (1.24-1 -> 1.25-1)
[2021-06-03T18:02:23-0500] [ALPM] upgraded okular (21.04.0-1 -> 21.04.1-1)
[2021-06-03T18:02:23-0500] [ALPM] upgraded pacman-mirrorlist (20210412-1 -> 20210504-1)
[2021-06-03T18:02:23-0500] [ALPM] upgraded partitionmanager (1:21.04.0-1 -> 1:21.04.1-1)
[2021-06-03T18:02:24-0500] [ALPM] upgraded partitionmanager-debug (1:21.04.0-1 -> 1:21.04.1-1)
[2021-06-03T18:02:24-0500] [ALPM] upgraded polkit-kde-agent-1 (5.21.4-1 -> 5.21.5-1)
[2021-06-03T18:02:24-0500] [ALPM] upgraded systemsettings (5.21.4-1 -> 5.21.5-1)
[2021-06-03T18:02:24-0500] [ALPM] upgraded powerdevil (5.21.4-1 -> 5.21.5-1)
[2021-06-03T18:02:24-0500] [ALPM] upgraded qqc2-desktop-style (5.81.0-3 -> 5.82.0-1)
[2021-06-03T18:02:24-0500] [ALPM] upgraded plasma-integration (5.21.4-1 -> 5.21.5-1)
[2021-06-03T18:02:26-0500] [ALPM] upgraded plasma-desktop (5.21.4-1 -> 5.21.5-2)
[2021-06-03T18:02:26-0500] [ALPM] upgraded plasma-disks (5.21.4-1 -> 5.21.5-1)
[2021-06-03T18:02:26-0500] [ALPM] upgraded plasma-firewall (5.21.4-1 -> 5.21.5-1)
[2021-06-03T18:02:26-0500] [ALPM] upgraded plasma-nm (5.21.4-1 -> 5.21.5-1)
[2021-06-03T18:02:26-0500] [ALPM] upgraded plasma-pa (5.21.4-1 -> 5.21.5-1)
[2021-06-03T18:02:26-0500] [ALPM] upgraded plasma-workspace-wallpapers (5.21.4-1 -> 5.21.5-1)
[2021-06-03T18:02:27-0500] [ALPM] upgraded print-manager (21.04.0-1 -> 21.04.1-1)
[2021-06-03T18:02:27-0500] [ALPM] upgraded python3-urllib3 (1.26.4-1 -> 1.26.5-1)
[2021-06-03T18:02:27-0500] [ALPM] upgraded rp-pppoe (3.14-4 -> 3.15-1)
[2021-06-03T18:02:27-0500] [ALPM] upgraded spectacle (21.04.0-1 -> 21.04.1-1)
[2021-06-03T18:02:27-0500] [ALPM] upgraded sudo (1.9.6.p1-1 -> 1.9.7-1)
[2021-06-03T18:02:27-0500] [ALPM] upgraded sweeper (21.04.0-1 -> 21.04.1-1)
[2021-06-03T18:02:27-0500] [ALPM] upgraded syslinux (6.04beta-2 -> 6.04beta3-1)
[2021-06-03T18:02:27-0500] [ALPM] upgraded testdisk (7.2-1 -> 7.2-2)
[2021-06-03T18:02:27-0500] [ALPM] upgraded vcdimager (2.0.1-2 -> 2.0.1-3)
[2021-06-03T18:02:28-0500] [ALPM] upgraded vim (8.2.2717-1 -> 8.2.2831-1)
[2021-06-03T18:02:28-0500] [ALPM] upgraded xfsprogs (5.11.0-4 -> 5.12.0-1)
[2021-06-03T18:02:28-0500] [ALPM] upgraded xorg-apps (7.14-1 -> 7.14-2)
[2021-06-03T18:02:28-0500] [ALPM] upgraded xorg-xauth (1.1-1 -> 1.1-2)
[2021-06-03T18:02:28-0500] [ALPM] upgraded yakuake (21.04.0-1 -> 21.04.1-1)
[2021-06-03T18:02:28-0500] [ALPM] upgraded youtube-dl (2021.04.17-1 -> 2021.05.16-1)
[2021-06-03T18:02:28-0500] [ALPM] transaction completed
[2021-06-03T18:02:28-0500] [ALPM] running '99-linux.hook'...
[2021-06-03T18:02:29-0500] [ALPM-SCRIPTLET] ==> Building image from preset: /etc/mkinitcpio.d/linux.preset: 'default'
[2021-06-03T18:02:29-0500] [ALPM-SCRIPTLET]   -> -k /boot/vmlinuz-linux -c /etc/mkinitcpio.conf -g /boot/initramfs-linux.img
[2021-06-03T18:02:29-0500] [ALPM-SCRIPTLET] ==> Starting build: 5.11.16-1
[2021-06-03T18:02:29-0500] [ALPM-SCRIPTLET]   -> Running build hook: [base]
[2021-06-03T18:02:29-0500] [ALPM-SCRIPTLET]   -> Running build hook: [udev]
[2021-06-03T18:02:29-0500] [ALPM-SCRIPTLET]   -> Running build hook: [autodetect]
[2021-06-03T18:02:29-0500] [ALPM-SCRIPTLET]   -> Running build hook: [modconf]
[2021-06-03T18:02:29-0500] [ALPM-SCRIPTLET]   -> Running build hook: [block]
[2021-06-03T18:02:30-0500] [ALPM-SCRIPTLET] ==> WARNING: Possibly missing firmware for module: xhci_pci
[2021-06-03T18:02:30-0500] [ALPM-SCRIPTLET]   -> Running build hook: [keyboard]
[2021-06-03T18:02:30-0500] [ALPM-SCRIPTLET]   -> Running build hook: [keymap]
[2021-06-03T18:02:30-0500] [ALPM-SCRIPTLET]   -> Running build hook: [filesystems]
[2021-06-03T18:02:30-0500] [ALPM-SCRIPTLET]   -> Running build hook: [fsck]
[2021-06-03T18:02:30-0500] [ALPM-SCRIPTLET] ==> Generating module dependencies
[2021-06-03T18:02:30-0500] [ALPM-SCRIPTLET] ==> Creating gzip-compressed initcpio image: /boot/initramfs-linux.img
[2021-06-03T18:02:32-0500] [ALPM-SCRIPTLET] ==> Image generation successful
[2021-06-03T18:02:32-0500] [ALPM-SCRIPTLET] ==> Building image from preset: /etc/mkinitcpio.d/linux.preset: 'fallback'
[2021-06-03T18:02:32-0500] [ALPM-SCRIPTLET]   -> -k /boot/vmlinuz-linux -c /etc/mkinitcpio.conf -g /boot/initramfs-linux-fallback.img -S autodetect
[2021-06-03T18:02:32-0500] [ALPM-SCRIPTLET] ==> Starting build: 5.11.16-1
[2021-06-03T18:02:32-0500] [ALPM-SCRIPTLET]   -> Running build hook: [base]
[2021-06-03T18:02:33-0500] [ALPM-SCRIPTLET]   -> Running build hook: [udev]
[2021-06-03T18:02:33-0500] [ALPM-SCRIPTLET]   -> Running build hook: [modconf]
[2021-06-03T18:02:33-0500] [ALPM-SCRIPTLET]   -> Running build hook: [block]
[2021-06-03T18:02:33-0500] [ALPM-SCRIPTLET] ==> WARNING: Possibly missing firmware for module: aic94xx
[2021-06-03T18:02:34-0500] [ALPM-SCRIPTLET] ==> WARNING: Possibly missing firmware for module: wd719x
[2021-06-03T18:02:35-0500] [ALPM-SCRIPTLET] ==> WARNING: Possibly missing firmware for module: xhci_pci
[2021-06-03T18:02:36-0500] [ALPM-SCRIPTLET]   -> Running build hook: [keyboard]
[2021-06-03T18:02:37-0500] [ALPM-SCRIPTLET]   -> Running build hook: [keymap]
[2021-06-03T18:02:37-0500] [ALPM-SCRIPTLET]   -> Running build hook: [filesystems]
[2021-06-03T18:02:38-0500] [ALPM-SCRIPTLET]   -> Running build hook: [fsck]
[2021-06-03T18:02:39-0500] [ALPM-SCRIPTLET] ==> Generating module dependencies
[2021-06-03T18:02:39-0500] [ALPM-SCRIPTLET] ==> Creating gzip-compressed initcpio image: /boot/initramfs-linux-fallback.img
[2021-06-03T18:02:46-0500] [ALPM-SCRIPTLET] ==> Image generation successful
[2021-06-03T18:02:46-0500] [ALPM] running 'fc-cache-install.hook'...
[2021-06-03T18:02:48-0500] [ALPM] running 'gdk-pixbuf-query-loaders.hook'...
[2021-06-03T18:02:48-0500] [ALPM] running 'gio-querymodules.hook'...
[2021-06-03T18:02:48-0500] [ALPM] running 'glib-compile-schemes.hook'...
[2021-06-03T18:02:48-0500] [ALPM-SCRIPTLET] Warning: Schema ?org.freedesktop.Telepathy.Logger? has path ?/apps/telepathy-logger/?.  Paths starting with ?/apps/?, ?/desktop/? or ?/system/? are deprecated.
[2021-06-03T18:02:48-0500] [ALPM-SCRIPTLET] Warning: Schema ?org.gnome.system.locale? has path ?/system/locale/?.  Paths starting with ?/apps/?, ?/desktop/? or ?/system/? are deprecated.
[2021-06-03T18:02:48-0500] [ALPM-SCRIPTLET] Warning: Schema ?org.gnome.system.proxy? has path ?/system/proxy/?.  Paths starting with ?/apps/?, ?/desktop/? or ?/system/? are deprecated.
[2021-06-03T18:02:48-0500] [ALPM-SCRIPTLET] Warning: Schema ?org.gnome.system.proxy.http? has path ?/system/proxy/http/?.  Paths starting with ?/apps/?, ?/desktop/? or ?/system/? are deprecated.
[2021-06-03T18:02:48-0500] [ALPM-SCRIPTLET] Warning: Schema ?org.gnome.system.proxy.https? has path ?/system/proxy/https/?.  Paths starting with ?/apps/?, ?/desktop/? or ?/system/? are deprecated.
[2021-06-03T18:02:48-0500] [ALPM-SCRIPTLET] Warning: Schema ?org.gnome.system.proxy.ftp? has path ?/system/proxy/ftp/?.  Paths starting with ?/apps/?, ?/desktop/? or ?/system/? are deprecated.
[2021-06-03T18:02:48-0500] [ALPM-SCRIPTLET] Warning: Schema ?org.gnome.system.proxy.socks? has path ?/system/proxy/socks/?.  Paths starting with ?/apps/?, ?/desktop/? or ?/system/? are deprecated.
[2021-06-03T18:02:48-0500] [ALPM] running 'systemd-tmpfiles.hook'...
[2021-06-03T18:02:48-0500] [ALPM] running 'texinfo-install.hook'...
[2021-06-03T18:02:49-0500] [ALPM] running 'update-desktop-database.hook'...
[2021-06-03T18:02:49-0500] [ALPM] running 'update-mime-database.hook'...


----------------------------------------------------------------------------------------------------------
cat /var/log/installation.log
----------------------------------------------------------------------------------------------------------

21:15:55 [6]: Calamares::Settings::Settings(const QString&, bool)
    Using Calamares settings file at "/usr/share/calamares/settings.conf" 
WARNING:     ..  Required settings.conf key oem-setup is missing. 
21:15:55 [6]: void Logger::setupLogfile()
    Using log file: "/root/.cache/calamares/session.log" 
21:15:55 [6]: void CalamaresApplication::init()
    Calamares version: 3.2.40.20210421-12ae26f0 
    ..  languages: "ast, ca, cs, de, en, es, es_AR, fr, hi_IN, hr, hu, id_ID, it, nl_NL, pl, pt_BR, pt_PT, ro_RO, ru, sl, sr_RS, sv, tr_TR" 
21:15:55 [6]: bool CalamaresUtils::initQmlModulesDir()
    Using Calamares QML directory "/usr/share/calamares/qml" 
21:15:55 [6]: Calamares::Branding::Branding(const QString&, QObject*)
    Using Calamares branding file at "/usr/share/calamares/branding/kaos_branding/branding.desc" 
21:15:55 [6]: Calamares::Branding::Branding(const QString&, QObject*)
    Loaded branding component "kaos_branding" 
    ..  No translation for "tz_" "en_US" using default (en) 
    ..  Loaded QRC translation "calamares_" "en_US" 
    ..  STARTUP: initSettings, initQmlPath, initBranding done 
    ..  STARTUP: initModuleManager: module init started 
21:15:55 [2]: static Calamares::ModuleSystem::Descriptor Calamares::ModuleSystem::Descriptor::fromDescriptorData(const QVariantMap&)
    WARNING: Module descriptor contains extra keys: 
     "requires" 
21:15:55 [6]: void Calamares::ModuleManager::doInit()
    Found 38 modules 
21:15:55 [6]: void CalamaresApplication::initView()
    STARTUP: initModuleManager: all modules init done 
21:15:55 [6]: void CalamaresApplication::initView()
    STARTUP: initJobQueue done 
21:15:55 [6]: CalamaresWindow::CalamaresWindow(QWidget*)
    Available desktop QSize(1890, 1080) minimum size QSize(1024, 520) 
    ..  Proposed window size: 1024 630 
21:15:57 [6]: QString CalamaresUtils::searchQmlFile(CalamaresUtils::QmlSearch, const QString&)
    Looking for QML for "calamares-sidebar" 
    ..  Looking at QML file "/usr/share/calamares/branding/kaos_branding/calamares-sidebar.qml" 
21:15:57 [6]: QString CalamaresUtils::searchQmlFile(CalamaresUtils::QmlSearch, const QString&)
    Looking for QML for "calamares-navigation" 
    ..  Looking at QML file "/usr/share/calamares/branding/kaos_branding/calamares-navigation.qml" 
21:15:57 [0]: QQmlEngine::setContextForObject(): Object already has a QQmlContext
21:15:57 [0]: QQmlEngine::setContextForObject(): Object already has a QQmlContext
21:15:57 [6]: void CalamaresApplication::initView()
    STARTUP: CalamaresWindow created; loadModules started 
21:15:57 [6]: void Calamares::Module::loadConfigurationFile(const QString&)
    Loaded module configuration "/usr/share/calamares/modules/welcomeq.conf" 
21:15:57 [6]: void Config::initLanguages()
    Matching locale QLocale(English, Latin, United States) 
    ..  Matched with index 4 "en_US" 
    ..  Branding using locale: "en_US" 
    ..  No translation for "tz_" "en_US" using default (en) 
    ..  Loaded QRC translation "calamares_" "en_US" 
21:15:57 [6]: void Config::setLocaleIndex(int)
    Index 4 Selected locale QLocale(English, Latin, United States) 
    ..  Branding using locale: "en_US" 
    ..  No translation for "tz_" "en_US" using default (en) 
    ..  Loaded QRC translation "calamares_" "en_US" 
21:15:57 [6]: QString CalamaresUtils::searchQmlFile(CalamaresUtils::QmlSearch, const QString&, const Calamares::ModuleSystem::InstanceKey&)
    Looking for QML for "[email protected]" 
    ..  Looking at QML file "/usr/share/calamares/branding/kaos_branding/[email protected]" 
    ..  Looking at QML file "/usr/share/calamares/branding/kaos_branding/welcomeq.qml" 
    ..  Looking at QML file ":/[email protected]" 
    ..  Looking at QML file ":/welcomeq.qml" 
21:15:57 [6]: virtual void Calamares::QmlViewStep::setConfigurationMap(const QVariantMap&)
    QmlViewStep "[email protected]" loading "qrc:/welcomeq.qml" 
21:15:57 [6]: QPair<CalamaresUtils::Network::RequestStatus, QNetworkReply*> CalamaresUtils::Network::synchronousRun(QNetworkAccessManager*, const QUrl&, const CalamaresUtils::Network::RequestOptions&)
    HTTP error QNetworkReply::HostNotFoundError on request for QUrl("https://ipapi.co/xml") 
21:15:57 [2]: QStringList CalamaresUtils::GeoIP::getElementTexts(const QByteArray&, const QString&)
    WARNING: GeoIP XML data error: "unexpected end of file" (line 1 1 ) 
21:15:57 [2]: QStringList CalamaresUtils::GeoIP::getElementTexts(const QByteArray&, const QString&)
    WARNING: GeopIP XML had no non-empty elements "country" 
21:15:57 [6]: virtual void Calamares::ViewModule::loadSelf()
    ViewModule "[email protected]" loading complete. 
21:15:57 [6]: void Calamares::Module::loadConfigurationFile(const QString&)
    Loaded module configuration "/usr/share/calamares/modules/locale.conf" 
21:15:57 [6]: virtual void Calamares::ViewModule::loadSelf()
    ViewModule "[email protected]" loading complete. 
21:15:57 [6]: void Calamares::Module::loadConfigurationFile(const QString&)
    Loaded module configuration "/usr/share/calamares/modules/keyboardq.conf" 
21:15:57 [6]: KeyboardModelsModel::KeyboardModelsModel(QObject*)
    Loaded 188 keyboard models 
21:15:57 [6]: void Config::detectCurrentKeyboardLayout()
    ("pc", "us", "us:2", "inet(evdev)\"") 
21:15:57 [2]: virtual void Calamares::QmlViewStep::setConfigurationMap(const QVariantMap&)
    WARNING: Bad QML search mode set for "[email protected]" 
21:15:57 [6]: QString CalamaresUtils::searchQmlFile(CalamaresUtils::QmlSearch, const QString&, const Calamares::ModuleSystem::InstanceKey&)
    Looking for QML for "[email protected]" 
    ..  Looking at QML file "/usr/share/calamares/branding/kaos_branding/[email protected]" 
    ..  Looking at QML file "/usr/share/calamares/branding/kaos_branding/keyboardq.qml" 
    ..  Looking at QML file ":/[email protected]" 
    ..  Looking at QML file ":/keyboardq.qml" 
21:15:57 [6]: virtual void Calamares::QmlViewStep::setConfigurationMap(const QVariantMap&)
    QmlViewStep "[email protected]" loading "qrc:/keyboardq.qml" 
21:15:57 [6]: virtual void Calamares::ViewModule::loadSelf()
    ViewModule "[email protected]" loading complete. 
21:15:57 [6]: void Calamares::Module::loadConfigurationFile(const QString&)
    Loaded module configuration "/usr/share/calamares/modules/packagechooser.conf" 
21:15:57 [6]: void PackageChooserViewStep::fillModel(const QVariantList&)
    Loading PackageChooser model items from config 
21:15:57 [6]: virtual void Calamares::ViewModule::loadSelf()
    ViewModule "[email protected]" loading complete. 
21:15:57 [6]: void Calamares::Module::loadConfigurationFile(const QString&)
    Loaded module configuration "/usr/share/calamares/modules/partition.conf" 
21:15:57 [6]: CalamaresUtils::Partition::InternalManager::InternalManager()
    KPMCore backend starting .. 
21:15:57 [8]: Loaded backend plugin:  "pmsfdiskbackendplugin"
    ..  Backend @0x1ba4610 "pmsfdiskbackendplugin" "1" 
21:15:57 [6]: CalamaresUtils::Partition::KPMManager::KPMManager()
    KPMManager 1 created. 
21:15:57 [6]: virtual void PartitionViewStep::setConfigurationMap(const QVariantMap&)
    Setting firmwareType to "efi" 
21:15:57 [6]: QString PartUtils::findFS(QString, FileSystem::Type*)
    Found filesystem "xfs" 
21:15:57 [6]: virtual void PartitionViewStep::setConfigurationMap(const QVariantMap&)
    Partition-module setting *defaultFileSystemType* "xfs" 
21:15:57 [2]: virtual void PartitionViewStep::setConfigurationMap(const QVariantMap&)
    WARNING: Partition-module setting *defaultPartitionTableType* is unset, will use gpt for efi or msdos for bios 
21:15:57 [6]: virtual void Calamares::ViewModule::loadSelf()
    ViewModule "[email protected]" loading complete. 
21:15:57 [6]: void Calamares::Module::loadConfigurationFile(const QString&)
    Loaded module configuration "/usr/share/calamares/modules/users.conf" 
    ..  libpwquality setting "minlen=0" 
    ..  libpwquality setting "minclass=0" 
    ..  maxLength set to 25 
    ..  minLength set to 8 
21:15:57 [6]: virtual void Calamares::ViewModule::loadSelf()
    ViewModule "[email protected]" loading complete. 
21:15:57 [6]: virtual void Calamares::ViewModule::loadSelf()
    ViewModule "[email protected]" loading complete. 
21:15:57 [6]: void Calamares::ModuleManager::loadModules()
    Module "[email protected]" already loaded. 
21:15:57 [6]: Calamares::SlideshowQML::SlideshowQML(QWidget*)
    QML import paths: 
     "/usr/share/calamares/qml" 
     "/usr/bin" 
     "qrc:/qt-project.org/imports" 
     "/usr/lib/qt5/qml" 
21:15:57 [6]: Calamares::SlideshowQML::SlideshowQML(QWidget*)
    QML load on startup, API 2. 
21:15:57 [6]: void Calamares::Module::loadConfigurationFile(const QString&)
    Loaded module configuration "/usr/share/calamares/modules/mount.conf" 
21:15:57 [6]: void Calamares::Module::loadConfigurationFile(const QString&)
    Loaded module configuration "/usr/share/calamares/modules/unpackfs.conf" 
21:15:57 [6]: void Calamares::Module::loadConfigurationFile(const QString&)
    Loaded module configuration "/usr/share/calamares/modules/machineid.conf" 
21:15:57 [6]: virtual void Calamares::CppJobModule::loadSelf()
    CppJobModule "[email protected]" loading complete. 
21:15:57 [6]: void Calamares::Module::loadConfigurationFile(const QString&)
    Loaded module configuration "/usr/share/calamares/modules/fstab.conf" 
21:15:57 [6]: void Calamares::ModuleManager::loadModules()
    Module "[email protected]" already loaded. 
21:15:57 [6]: void Calamares::ModuleManager::loadModules()
    Module "[email protected]" already loaded. 
21:15:57 [6]: virtual void Calamares::CppJobModule::loadSelf()
    CppJobModule "[email protected]" loading complete. 
21:15:57 [6]: void Calamares::Module::loadConfigurationFile(const QString&)
    Loaded module configuration "/usr/share/calamares/modules/luksopenswaphookcfg.conf" 
21:15:57 [6]: void Calamares::Module::loadConfigurationFile(const QString&)
    No config file for "initcpiocfg" found anywhere at 
     "/home/live/src/modules/initcpiocfg/initcpiocfg.conf" 
     "/etc/calamares/modules/initcpiocfg.conf" 
     "/usr/share/calamares/modules/initcpiocfg.conf" 
21:15:57 [6]: void Calamares::Module::loadConfigurationFile(const QString&)
    Loaded module configuration "/usr/share/calamares/modules/initcpio.conf" 
21:15:57 [6]: virtual void Calamares::CppJobModule::loadSelf()
    CppJobModule "[email protected]" loading complete. 
21:15:57 [6]: void Calamares::ModuleManager::loadModules()
    Module "[email protected]" already loaded. 
21:15:57 [6]: void Calamares::Module::loadConfigurationFile(const QString&)
    Loaded module configuration "/usr/share/calamares/modules/services.conf" 
21:15:57 [6]: void Calamares::Module::loadConfigurationFile(const QString&)
    Loaded module configuration "/usr/share/calamares/modules/grubconf.conf" 
21:15:57 [6]: void Calamares::Module::loadConfigurationFile(const QString&)
    Loaded module configuration "/usr/share/calamares/modules/kdm_sddm.conf" 
21:15:57 [6]: void Calamares::Module::loadConfigurationFile(const QString&)
    No config file for "userkf5" found anywhere at 
     "/home/live/src/modules/userkf5/userkf5.conf" 
     "/etc/calamares/modules/userkf5.conf" 
     "/usr/share/calamares/modules/userkf5.conf" 
21:15:57 [6]: void Calamares::Module::loadConfigurationFile(const QString&)
    No config file for "driver_cleanup" found anywhere at 
     "/home/live/src/modules/driver_cleanup/driver_cleanup.conf" 
     "/etc/calamares/modules/driver_cleanup.conf" 
     "/usr/share/calamares/modules/driver_cleanup.conf" 
21:15:57 [6]: void Calamares::Module::loadConfigurationFile(const QString&)
    No config file for "nonfree_drivers" found anywhere at 
     "/home/live/src/modules/nonfree_drivers/nonfree_drivers.conf" 
     "/etc/calamares/modules/nonfree_drivers.conf" 
     "/usr/share/calamares/modules/nonfree_drivers.conf" 
21:15:57 [6]: void Calamares::Module::loadConfigurationFile(const QString&)
    No config file for "package_removal" found anywhere at 
     "/home/live/src/modules/package_removal/package_removal.conf" 
     "/etc/calamares/modules/package_removal.conf" 
     "/usr/share/calamares/modules/package_removal.conf" 
21:15:57 [6]: void Calamares::Module::loadConfigurationFile(const QString&)
    Loaded module configuration "/usr/share/calamares/modules/bootldr.conf" 
21:15:57 [6]: void Calamares::Module::loadConfigurationFile(const QString&)
    No config file for "gummi_entries" found anywhere at 
     "/home/live/src/modules/gummi_entries/gummi_entries.conf" 
     "/etc/calamares/modules/gummi_entries.conf" 
     "/usr/share/calamares/modules/gummi_entries.conf" 
21:15:57 [6]: void Calamares::Module::loadConfigurationFile(const QString&)
    Loaded module configuration "/usr/share/calamares/modules/umount.conf" 
21:15:57 [6]: void Calamares::Module::loadConfigurationFile(const QString&)
    Loaded module configuration "/usr/share/calamares/modules/finishedq.conf" 
21:15:57 [2]: virtual void Calamares::QmlViewStep::setConfigurationMap(const QVariantMap&)
    WARNING: Bad QML search mode set for "[email protected]" 
21:15:57 [6]: QString CalamaresUtils::searchQmlFile(CalamaresUtils::QmlSearch, const QString&, const Calamares::ModuleSystem::InstanceKey&)
    Looking for QML for "[email protected]" 
    ..  Looking at QML file "/usr/share/calamares/branding/kaos_branding/[email protected]" 
    ..  Looking at QML file "/usr/share/calamares/branding/kaos_branding/finishedq.qml" 
    ..  Looking at QML file ":/[email protected]" 
    ..  Looking at QML file ":/finishedq.qml" 
21:15:57 [6]: virtual void Calamares::QmlViewStep::setConfigurationMap(const QVariantMap&)
    QmlViewStep "[email protected]" loading "qrc:/finishedq.qml" 
21:15:57 [6]: virtual void Calamares::ViewModule::loadSelf()
    ViewModule "[email protected]" loading complete. 
21:15:57 [6]: setGeoIP(Config*, const QVariantMap&)::<lambda()>
    GeoIP result for welcome= "" 
21:15:57 [6]: void setCountry(Config*, const QString&, CalamaresUtils::GeoIP::Handler*)
    Unusable country code "" 
    ..  Obtained from "https://ipapi.co/xml"  ( 2 "country" ) 
21:15:57 [6]: void CalamaresApplication::initViewSteps()
    STARTUP: loadModules for all modules done 
21:15:57 [6]: void Calamares::ModuleManager::checkRequirements()
    Checking module requirements .. 
21:15:57 [6]: void CalamaresApplication::initViewSteps()
    STARTUP: Window now visible and ProgressTreeView populated 
    ..  9 view steps loaded. 
21:15:57 [6]: bool GeneralRequirements::checkHasPower()
    A battery exists, checking for mains power. 
21:15:57 [6]: QPair<CalamaresUtils::Network::RequestStatus, QNetworkReply*> CalamaresUtils::Network::synchronousRun(QNetworkAccessManager*, const QUrl&, const CalamaresUtils::Network::RequestOptions&)
    HTTP error QNetworkReply::HostNotFoundError on request for QUrl("http://google.com") 
21:15:57 [6]: Calamares::RequirementsList GeneralRequirements::checkRequirements()
    GeneralRequirements output: 
     storage :   11274289152 
     enoughStorage :   true 
     RAM :   1073741824 
     enoughRam :   true 
     hasPower :   false 
     hasInternet :   false 
     isRoot :   true 
21:15:57 [6]: void Calamares::RequirementsChecker::addCheckedRequirements(Calamares::Module*)
    Got 6 requirement results from "welcomeq" 
21:15:58 [6]: Config::Config(QObject*)::<lambda(int)>::<lambda()>
    xkbmap selection changed to:  "us" - "" 
21:15:58 [6]: void Calamares::SlideshowQML::loadQmlV2Complete()
    QML component complete, API 2 
21:15:58 [8]: smartctl initialization failed for  "/dev/mmcblk0" :  No such file or directory
21:15:58 [8]: error during smart output parsing for  "/dev/mmcblk0" :  Success
    ..  Loading "/usr/share/calamares/branding/kaos_branding/show.qml" 
21:15:58 [6]: QPair<CalamaresUtils::Network::RequestStatus, QNetworkReply*> CalamaresUtils::Network::synchronousRun(QNetworkAccessManager*, const QUrl&, const CalamaresUtils::Network::RequestOptions&)
    HTTP error QNetworkReply::HostNotFoundError on request for QUrl("https://geoip.kde.org/v1/calamares") 
21:15:58 [6]: void Calamares::QmlViewStep::loadComplete()
    QML component "qrc:/finishedq.qml" QQmlComponent::Ready 
    ..  QML component complete "qrc:/finishedq.qml" creating object 
21:15:58 [0]: QQmlEngine::setContextForObject(): Object already has a QQmlContext
21:15:58 [0]: qrc:/finishedq.qml:28: TypeError: Cannot read property 'height' of null
21:15:58 [0]: qrc:/finishedq.qml:27: TypeError: Cannot read property 'width' of null
21:15:58 [6]: void Calamares::QmlViewStep::loadComplete()
    QML component "qrc:/keyboardq.qml" QQmlComponent::Ready 
    ..  QML component complete "qrc:/keyboardq.qml" creating object 
21:15:58 [8]: smartctl initialization failed for  "/dev/sda" :  No such file or directory
21:15:58 [8]: error during smart output parsing for  "/dev/sda" :  Success
21:15:58 [0]: qrc:/keyboardq.qml:97: TypeError: Cannot read property 'width' of null
21:15:58 [0]: qrc:/keyboardq.qml:97: TypeError: Cannot read property 'width' of null
21:15:58 [0]: qrc:/keyboardq.qml:97: TypeError: Cannot read property 'width' of null
21:15:58 [0]: qrc:/keyboardq.qml:97: TypeError: Cannot read property 'width' of null
21:15:58 [0]: qrc:/keyboardq.qml:97: TypeError: Cannot read property 'width' of null
21:15:58 [0]: qrc:/keyboardq.qml:97: TypeError: Cannot read property 'width' of null
21:15:58 [0]: qrc:/keyboardq.qml:97: TypeError: Cannot read property 'width' of null
21:15:58 [0]: qrc:/keyboardq.qml:97: TypeError: Cannot read property 'width' of null
21:15:58 [0]: qrc:/keyboardq.qml:97: TypeError: Cannot read property 'width' of null
21:15:58 [6]: void Calamares::QmlViewStep::loadComplete()
    QML component "qrc:/welcomeq.qml" QQmlComponent::Ready 
    ..  QML component complete "qrc:/welcomeq.qml" creating object 
21:15:58 [0]: QQmlEngine::setContextForObject(): Object already has a QQmlContext
21:15:58 [0]: QQmlEngine::setContextForObject(): Object already has a QQmlContext
21:15:59 [0]: QQmlEngine::setContextForObject(): Object already has a QQmlContext
21:15:59 [6]: QList<Device*> PartUtils::getDevices(PartUtils::DeviceType)
    Removing unsuitable devices: 2 candidates. 
21:15:59 [6]: void CalamaresUtils::callQmlFunction(QQuickItem*, const char*)
    QML "onActivate()" is missing. 
21:15:59 [6]: void Calamares::RequirementsChecker::reportProgress()
    Remaining modules: 1 
     "partition" 
    ..  Removing device with iso9660 filesystem (probably a CD) on it "/dev/sda" 
21:15:59 [6]: void PartitionCoreModule::doInit()
    LIST OF DETECTED DEVICES: 
21:15:59 [6]: void PartitionCoreModule::doInit()
    node	capacity	name	prettyName 
21:15:59 [6]: void PartitionCoreModule::doInit()
    "/dev/mmcblk0" 62536803840 "mmcblk0" "mmcblk0 – 58.24 GiB (/dev/mmcblk0)" 
    ..  1 devices detected. 
21:16:00 [6]: void Calamares::RequirementsChecker::reportProgress()
    Remaining modules: 1 
     "partition" 
21:16:00 [6]: OsproberEntryList PartUtils::runOsprober(DeviceModel*)
    os-prober gave no output. 
21:16:00 [6]: void PartitionCoreModule::scanForEfiSystemPartitions()
    system is EFI and new EFI system partition has been found. 
21:16:00 [6]: void Calamares::RequirementsChecker::addCheckedRequirements(Calamares::Module*)
    Got 1 requirement results from "partition" 
21:16:00 [0]: QObject::connect: Cannot queue arguments of type 'QQmlChangeSet'
(Make sure 'QQmlChangeSet' is registered using qRegisterMetaType().)
21:16:00 [6]: void ChoicePage::updateDeviceStatePreview()
    Updating partitioning state widgets. 
21:16:00 [6]: void ChoicePage::setupActions()
    Setting up actions for "/dev/mmcblk0" with 0 entries. 
21:16:00 [6]: bool PartUtils::canBeResized(Partition*)
    Checking if "/dev/mmcblk0p1" can be resized. 
    ..  NO, filesystem "fat32" does not support resize. 
21:16:00 [6]: bool PartUtils::canBeReplaced(Partition*)
    Checking if "/dev/mmcblk0p1" can be replaced. 
    ..  NO, insufficient storage 
     Required  storage B: 11811160064 "(10.5GiB)" 
     Available storage B: 536870912 "(0GiB)" 
21:16:00 [6]: bool PartUtils::canBeResized(Partition*)
    Checking if "/dev/mmcblk0p2" can be resized. 
21:16:00 [6]: bool PartUtils::canBeResized(Partition*)
    Partition "/dev/mmcblk0p2" authorized for resize + autopartition install. 
    ..  contains resizable "/dev/mmcblk0p2" 
21:16:00 [6]: bool PartUtils::canBeReplaced(Partition*)
    Checking if "/dev/mmcblk0p2" can be replaced. 
21:16:00 [6]: bool PartUtils::canBeReplaced(Partition*)
    Partition "/dev/mmcblk0p2" authorized for replace install. 
    ..  contains replaceable "/dev/mmcblk0p2" 
21:16:00 [6]: bool PartUtils::canBeResized(Partition*)
    Checking if "/dev/mmcblk0p3" can be resized. 
    ..  NO, insufficient storage 
     Required  storage B: 13958643712 "(13GiB)" 
     Available storage B: 2148515328 "(2GiB)" for "/dev/mmcblk0p3" length: 4196319 sectorsUsed: 0 fsType: "linuxswap" 
21:16:00 [6]: bool PartUtils::canBeReplaced(Partition*)
    Checking if "/dev/mmcblk0p3" can be replaced. 
    ..  NO, insufficient storage 
     Required  storage B: 11811160064 "(10.5GiB)" 
     Available storage B: 2148515328 "(2GiB)" 
21:16:00 [6]: ChoicePage::setupActions()::<lambda()>
    Setting texts for 0 osprober entries 
21:16:00 [6]: void ChoicePage::continueApplyDeviceChoice()
    Previous device -1 new device 0 
21:16:00 [6]: void ChoicePage::applyActionChoice(InstallChoice)
    Prev -1 InstallChoice Config::NoChoice "none" 
21:16:00 [6]: void ChoicePage::updateActionChoicePreview(InstallChoice)
    Updating partitioning preview widgets. 
21:16:01 [6]: void Calamares::RequirementsChecker::finished()
    All requirements have been checked. 
21:16:01 [6]: void Calamares::RequirementsModel::describe() const
    Requirements model has 7 items 
    ..  requirement 0 "storage" satisfied? true mandatory? true 
    ..  requirement 1 "ram" satisfied? true mandatory? true 
    ..  requirement 2 "power" satisfied? false mandatory? false 
    ..  requirement 3 "internet" satisfied? false mandatory? false 
    ..  requirement 4 "root" satisfied? true mandatory? true 
    ..  requirement 5 "screen" satisfied? true mandatory? false 
    ..  requirement 6 "partitions" satisfied? true mandatory? true 
21:17:04 [6]: void CalamaresUtils::callQmlFunction(QQuickItem*, const char*)
    QML "onLeave()" is missing. 
16:17:29 [6]: void Config::onActivate()
    Got locale language "en_US.UTF-8" 
    ..  extracted country "United States" :: ("en", "US") 
    ..  looking for locale part "US" 
    ..  matched "us" 
16:17:29 [6]: void Config::guessLayout(const QStringList&)
    Next level: "en" 
16:17:35 [0]: qrc:/keyboardq.qml:97: TypeError: Cannot read property 'width' of null
16:17:35 [0]: qrc:/keyboardq.qml:97: TypeError: Cannot read property 'width' of null
16:17:35 [0]: qrc:/keyboardq.qml:97: TypeError: Cannot read property 'width' of null
16:17:35 [0]: qrc:/keyboardq.qml:97: TypeError: Cannot read property 'width' of null
16:17:35 [0]: qrc:/keyboardq.qml:97: TypeError: Cannot read property 'width' of null
16:17:35 [0]: qrc:/keyboardq.qml:97: TypeError: Cannot read property 'width' of null
16:17:35 [0]: qrc:/keyboardq.qml:97: TypeError: Cannot read property 'width' of null
16:17:35 [0]: qrc:/keyboardq.qml:97: TypeError: Cannot read property 'width' of null
16:17:35 [0]: qrc:/keyboardq.qml:97: TypeError: Cannot read property 'width' of null
16:17:35 [0]: qrc:/keyboardq.qml:97: TypeError: Cannot read property 'width' of null
16:17:35 [0]: qrc:/keyboardq.qml:97: TypeError: Cannot read property 'width' of null
16:17:35 [0]: qrc:/keyboardq.qml:97: TypeError: Cannot read property 'width' of null
16:17:35 [0]: qrc:/keyboardq.qml:97: TypeError: Cannot read property 'width' of null
16:17:35 [0]: qrc:/keyboardq.qml:97: TypeError: Cannot read property 'width' of null
16:17:35 [0]: qrc:/keyboardq.qml:97: TypeError: Cannot read property 'width' of null
16:17:35 [0]: qrc:/keyboardq.qml:97: TypeError: Cannot read property 'width' of null
16:17:35 [0]: qrc:/keyboardq.qml:97: TypeError: Cannot read property 'width' of null
16:17:35 [0]: qrc:/keyboardq.qml:97: TypeError: Cannot read property 'width' of null
16:17:35 [0]: qrc:/keyboardq.qml:97: TypeError: Cannot read property 'width' of null
16:17:35 [0]: qrc:/keyboardq.qml:97: TypeError: Cannot read property 'width' of null
16:17:35 [0]: qrc:/keyboardq.qml:97: TypeError: Cannot read property 'width' of null
16:17:35 [0]: qrc:/keyboardq.qml:97: TypeError: Cannot read property 'width' of null
16:17:35 [0]: qrc:/keyboardq.qml:97: TypeError: Cannot read property 'width' of null
16:17:35 [0]: qrc:/keyboardq.qml:97: TypeError: Cannot read property 'width' of null
16:17:35 [0]: qrc:/keyboardq.qml:97: TypeError: Cannot read property 'width' of null
16:17:35 [0]: qrc:/keyboardq.qml:97: TypeError: Cannot read property 'width' of null
16:17:35 [0]: qrc:/keyboardq.qml:97: TypeError: Cannot read property 'width' of null
16:17:35 [0]: qrc:/keyboardq.qml:97: TypeError: Cannot read property 'width' of null
16:17:35 [0]: qrc:/keyboardq.qml:97: TypeError: Cannot read property 'width' of null
16:17:35 [0]: qrc:/keyboardq.qml:97: TypeError: Cannot read property 'width' of null
16:17:35 [0]: qrc:/keyboardq.qml:97: TypeError: Cannot read property 'width' of null
16:17:35 [0]: qrc:/keyboardq.qml:97: TypeError: Cannot read property 'width' of null
16:17:35 [0]: qrc:/keyboardq.qml:97: TypeError: Cannot read property 'width' of null
16:17:35 [0]: qrc:/keyboardq.qml:97: TypeError: Cannot read property 'width' of null
16:17:35 [0]: qrc:/keyboardq.qml:97: TypeError: Cannot read property 'width' of null
16:17:35 [0]: qrc:/keyboardq.qml:97: TypeError: Cannot read property 'width' of null
16:17:35 [0]: qrc:/keyboardq.qml:97: TypeError: Cannot read property 'width' of null
16:17:35 [0]: qrc:/keyboardq.qml:97: TypeError: Cannot read property 'width' of null
16:17:35 [0]: qrc:/keyboardq.qml:97: TypeError: Cannot read property 'width' of null
16:17:35 [0]: qrc:/keyboardq.qml:97: TypeError: Cannot read property 'width' of null
16:17:35 [0]: qrc:/keyboardq.qml:97: TypeError: Cannot read property 'width' of null
16:17:35 [0]: qrc:/keyboardq.qml:97: TypeError: Cannot read property 'width' of null
16:17:35 [0]: qrc:/keyboardq.qml:97: TypeError: Cannot read property 'width' of null
16:17:35 [0]: qrc:/keyboardq.qml:97: TypeError: Cannot read property 'width' of null
16:17:35 [0]: qrc:/keyboardq.qml:97: TypeError: Cannot read property 'width' of null
16:17:35 [0]: qrc:/keyboardq.qml:97: TypeError: Cannot read property 'width' of null
16:17:35 [0]: qrc:/keyboardq.qml:97: TypeError: Cannot read property 'width' of null
16:17:35 [0]: qrc:/keyboardq.qml:97: TypeError: Cannot read property 'width' of null
16:17:35 [0]: qrc:/keyboardq.qml:97: TypeError: Cannot read property 'width' of null
16:17:35 [0]: qrc:/keyboardq.qml:97: TypeError: Cannot read property 'width' of null
16:17:35 [0]: qrc:/keyboardq.qml:97: TypeError: Cannot read property 'width' of null
16:17:35 [0]: qrc:/keyboardq.qml:97: TypeError: Cannot read property 'width' of null
16:17:35 [0]: qrc:/keyboardq.qml:97: TypeError: Cannot read property 'width' of null
16:17:35 [0]: qrc:/keyboardq.qml:97: TypeError: Cannot read property 'width' of null
16:17:35 [0]: qrc:/keyboardq.qml:97: TypeError: Cannot read property 'width' of null
16:17:35 [0]: qrc:/keyboardq.qml:97: TypeError: Cannot read property 'width' of null
16:17:35 [0]: qrc:/keyboardq.qml:97: TypeError: Cannot read property 'width' of null
16:17:35 [0]: qrc:/keyboardq.qml:97: TypeError: Cannot read property 'width' of null
16:17:35 [0]: qrc:/keyboardq.qml:97: TypeError: Cannot read property 'width' of null
16:17:35 [0]: qrc:/keyboardq.qml:97: TypeError: Cannot read property 'width' of null
16:17:35 [0]: qrc:/keyboardq.qml:97: TypeError: Cannot read property 'width' of null
16:17:35 [0]: qrc:/keyboardq.qml:97: TypeError: Cannot read property 'width' of null
16:17:35 [0]: qrc:/keyboardq.qml:97: TypeError: Cannot read property 'width' of null
16:17:35 [0]: qrc:/keyboardq.qml:97: TypeError: Cannot read property 'width' of null
16:17:35 [0]: qrc:/keyboardq.qml:97: TypeError: Cannot read property 'width' of null
16:17:35 [0]: qrc:/keyboardq.qml:97: TypeError: Cannot read property 'width' of null
16:17:35 [0]: qrc:/keyboardq.qml:97: TypeError: Cannot read property 'width' of null
16:17:35 [0]: qrc:/keyboardq.qml:97: TypeError: Cannot read property 'width' of null
16:17:35 [0]: qrc:/keyboardq.qml:97: TypeError: Cannot read property 'width' of null
16:17:35 [0]: qrc:/keyboardq.qml:97: TypeError: Cannot read property 'width' of null
16:17:35 [0]: qrc:/keyboardq.qml:97: TypeError: Cannot read property 'width' of null
16:17:35 [0]: qrc:/keyboardq.qml:97: TypeError: Cannot read property 'width' of null
16:17:35 [0]: qrc:/keyboardq.qml:97: TypeError: Cannot read property 'width' of null
16:17:35 [0]: qrc:/keyboardq.qml:97: TypeError: Cannot read property 'width' of null
16:17:35 [0]: qrc:/keyboardq.qml:97: TypeError: Cannot read property 'width' of null
16:17:36 [0]: qrc:/keyboardq.qml:97: TypeError: Cannot read property 'width' of null
16:17:36 [0]: qrc:/keyboardq.qml:97: TypeError: Cannot read property 'width' of null
16:17:36 [0]: qrc:/keyboardq.qml:97: TypeError: Cannot read property 'width' of null
16:17:36 [0]: qrc:/keyboardq.qml:97: TypeError: Cannot read property 'width' of null
16:17:36 [0]: qrc:/keyboardq.qml:97: TypeError: Cannot read property 'width' of null
16:17:36 [0]: qrc:/keyboardq.qml:97: TypeError: Cannot read property 'width' of null
16:17:36 [0]: qrc:/keyboardq.qml:97: TypeError: Cannot read property 'width' of null
16:17:36 [0]: qrc:/keyboardq.qml:97: TypeError: Cannot read property 'width' of null
16:17:36 [0]: qrc:/keyboardq.qml:97: TypeError: Cannot read property 'width' of null
16:17:36 [0]: qrc:/keyboardq.qml:97: TypeError: Cannot read property 'width' of null
16:17:36 [0]: qrc:/keyboardq.qml:97: TypeError: Cannot read property 'width' of null
16:17:36 [0]: qrc:/keyboardq.qml:97: TypeError: Cannot read property 'width' of null
16:17:36 [0]: qrc:/keyboardq.qml:97: TypeError: Cannot read property 'width' of null
16:17:36 [0]: qrc:/keyboardq.qml:97: TypeError: Cannot read property 'width' of null
16:17:36 [0]: qrc:/keyboardq.qml:97: TypeError: Cannot read property 'width' of null
16:17:36 [0]: qrc:/keyboardq.qml:97: TypeError: Cannot read property 'width' of null
16:17:36 [0]: qrc:/keyboardq.qml:97: TypeError: Cannot read property 'width' of null
16:17:36 [0]: qrc:/keyboardq.qml:97: TypeError: Cannot read property 'width' of null
16:17:36 [0]: qrc:/keyboardq.qml:97: TypeError: Cannot read property 'width' of null
16:17:36 [0]: qrc:/keyboardq.qml:97: TypeError: Cannot read property 'width' of null
16:17:36 [0]: qrc:/keyboardq.qml:97: TypeError: Cannot read property 'width' of null
16:17:36 [0]: qrc:/keyboardq.qml:97: TypeError: Cannot read property 'width' of null
16:17:36 [0]: qrc:/keyboardq.qml:97: TypeError: Cannot read property 'width' of null
16:17:36 [0]: qrc:/keyboardq.qml:97: TypeError: Cannot read property 'width' of null
16:17:36 [0]: qrc:/keyboardq.qml:97: TypeError: Cannot read property 'width' of null
16:17:36 [0]: qrc:/keyboardq.qml:97: TypeError: Cannot read property 'width' of null
16:17:36 [0]: qrc:/keyboardq.qml:97: TypeError: Cannot read property 'width' of null
16:17:36 [0]: qrc:/keyboardq.qml:97: TypeError: Cannot read property 'width' of null
16:17:36 [0]: qrc:/keyboardq.qml:97: TypeError: Cannot read property 'width' of null
16:17:36 [0]: qrc:/keyboardq.qml:97: TypeError: Cannot read property 'width' of null
16:18:01 [6]: virtual void PackageChooserViewStep::onLeave()
    PackageChooser "packagechooser_packagechooser" selected "libreoffice" 
16:18:17 [6]: void ChoicePage::applyActionChoice(InstallChoice)
    Prev -1 InstallChoice Config::Erase "erase" 
16:18:17 [6]: CalamaresUtils::Partition::KPMManager::KPMManager()
    KPMManager 2 created. 
16:18:17 [6]: PartitionTable* CreatePartitionTableJob::createTable()
    CreatePartitionTableJob::createTable trying to make table for device "/dev/mmcblk0" 
16:18:17 [2]: void PartitionCoreModule::scanForEfiSystemPartitions()
    WARNING: system is EFI but no EFI system partitions found. 
16:18:17 [6]: CalamaresUtils::Partition::KPMManager::KPMManager()
    KPMManager 3 created. 
16:18:17 [6]: CalamaresUtils::Partition::KPMManager::KPMManager()
    KPMManager 4 created. 
16:18:17 [6]: void PartitionCoreModule::scanForEfiSystemPartitions()
    system is EFI and new EFI system partition has been found. 
16:18:17 [6]: CalamaresUtils::Partition::KPMManager::KPMManager()
    KPMManager 5 created. 
16:18:17 [6]: void PartitionCoreModule::dumpQueue() const
    # Queue: 
16:18:17 [6]: void PartitionCoreModule::dumpQueue() const
    ## Device: "mmcblk0" 
16:18:17 [6]: void PartitionCoreModule::dumpQueue() const
    - "Create new gpt partition table on /dev/mmcblk0." 
16:18:17 [6]: void PartitionCoreModule::dumpQueue() const
    - "Create new 300MiB partition on /dev/mmcblk0 (mmcblk0)." 
16:18:17 [6]: void PartitionCoreModule::dumpQueue() const
    - "Set flags on 300MiB fat32 partition." 
16:18:17 [6]: void PartitionCoreModule::dumpQueue() const
    - "Create new 59337MiB partition on /dev/mmcblk0 (mmcblk0) with entries root." 
16:18:17 [6]: void ChoicePage::updateActionChoicePreview(InstallChoice)
    Updating partitioning preview widgets. 
16:22:25 [0]: QLayout: Attempting to add QLayout "" to QWidget "", which already has a layout
16:22:25 [0]: QObject::setParent: Cannot set parent, new parent is in a different thread
16:22:25 [6]: QVariantList FillGlobalStorageJob::createPartitionList() const
    Building partition information map 
    ..  partitions on "/dev/mmcblk0" 
    ..  mapping for "" "unallocated" 
     partlabel :   "" 
     partuuid :   "" 
     parttype :   "" 
     partattrs :   "0" 
     mountPoint: :   "" 
     fs: :   "unknown" 
     fsName :   "unknown" 
     uuid :   "" 
     claimed :   "false" 
    ..  mapping for "" "New Partition" 
     partlabel :   "" 
     partuuid :   "" 
     parttype :   "" 
     partattrs :   "0" 
     mountPoint: :   "/boot" 
     fs: :   "fat32" 
     fsName :   "fat32" 
     uuid :   "" 
     claimed :   "true" 
    ..  mapping for "" "New Partition" 
     partlabel :   "root" 
     partuuid :   "" 
     parttype :   "" 
     partattrs :   "140017075893344" 
     mountPoint: :   "/" 
     fs: :   "xfs" 
     fsName :   "xfs" 
     uuid :   "" 
     claimed :   "true" 
16:22:25 [6]: QVariantList FillGlobalStorageJob::createPartitionList() const
    Building partition information map 
    ..  partitions on "/dev/mmcblk0" 
    ..  mapping for "" "unallocated" 
     partlabel :   "" 
     partuuid :   "" 
     parttype :   "" 
     partattrs :   "0" 
     mountPoint: :   "" 
     fs: :   "unknown" 
     fsName :   "unknown" 
     uuid :   "" 
     claimed :   "false" 
    ..  mapping for "" "New Partition" 
     partlabel :   "" 
     partuuid :   "" 
     parttype :   "" 
     partattrs :   "0" 
     mountPoint: :   "/boot" 
     fs: :   "fat32" 
     fsName :   "fat32" 
     uuid :   "" 
     claimed :   "true" 
    ..  mapping for "" "New Partition" 
     partlabel :   "root" 
     partuuid :   "" 
     parttype :   "" 
     partattrs :   "140017075893344" 
     mountPoint: :   "/" 
     fs: :   "xfs" 
     fsName :   "xfs" 
     uuid :   "" 
     claimed :   "true" 
16:22:25 [6]: void SummaryPage::onActivate()
    Summary widget is larger than viewport, enlarge by 47 to QSize(834, 629) 
16:22:55 [6]: void CalamaresUtils::callQmlFunction(QQuickItem*, const char*)
    QML "onActivate()" is missing. 
16:22:55 [6]: void Calamares::JobThread::finalize()
    There are 37 jobs, total weight 35 
    ..  Job 1 "Manage auto-mount settings" +wt 0.111111 tot.wt 0.111111 
    ..  Job 2 "Clear all temporary mounts." +wt 0.111111 tot.wt 0.222222 
    ..  Job 3 "Clear mounts for partitioning operations on /dev/mmcblk0" +wt 0.111111 tot.wt 0.333333 
    ..  Job 4 "Create new gpt partition table on /dev/mmcblk0." +wt 0.111111 tot.wt 0.444444 
    ..  Job 5 "Create new 300MiB partition on /dev/mmcblk0 (mmcblk0)." +wt 0.111111 tot.wt 0.555556 
    ..  Job 6 "Set flags on 300MiB fat32 partition." +wt 0.111111 tot.wt 0.666667 
    ..  Job 7 "Create new 59337MiB partition on /dev/mmcblk0 (mmcblk0) with entries root." +wt 0.111111 tot.wt 0.777778 
    ..  Job 8 "Set partition information" +wt 0.111111 tot.wt 0.888889 
    ..  Job 9 "Manage auto-mount settings" +wt 0.111111 tot.wt 1 
    ..  Job 10 "mount" +wt 1 tot.wt 2 
    ..  Job 11 "unpackfs" +wt 12 tot.wt 14 
    ..  Job 12 "Generate machine-id." +wt 1 tot.wt 15 
    ..  Job 13 "fstab" +wt 1 tot.wt 16 
    ..  Job 14 "Set timezone to America/***" +wt 1 tot.wt 17 
    ..  Job 15 "Set keyboard model to pc105, layout to us-" +wt 1 tot.wt 18 
    ..  Job 16 "localecfg" +wt 1 tot.wt 19 
    ..  Job 17 "Configuring LUKS key file." +wt 1 tot.wt 20 
    ..  Job 18 "luksopenswaphookcfg" +wt 1 tot.wt 21 
    ..  Job 19 "initcpiocfg" +wt 1 tot.wt 22 
    ..  Job 20 "Creating initramfs with mkinitcpio." +wt 1 tot.wt 23 
    ..  Job 21 "Configure <pre>sudo</pre> users." +wt 0.166667 tot.wt 23.1667 
    ..  Job 22 "Preparing groups." +wt 0.166667 tot.wt 23.3333 
    ..  Job 23 "Create user kate" +wt 0.166667 tot.wt 23.5 
    ..  Job 24 "Set password for user kate" +wt 0.166667 tot.wt 23.6667 
    ..  Job 25 "Set password for user root" +wt 0.166667 tot.wt 23.8333 
    ..  Job 26 "Set hostname Huxley" +wt 0.166667 tot.wt 24 
    ..  Job 27 "networkcfg" +wt 1 tot.wt 25 
    ..  Job 28 "services" +wt 1 tot.wt 26 
    ..  Job 29 "grubconf" +wt 1 tot.wt 27 
    ..  Job 30 "kdm_sddm" +wt 1 tot.wt 28 
    ..  Job 31 "userkf5" +wt 1 tot.wt 29 
    ..  Job 32 "driver_cleanup" +wt 1 tot.wt 30 
    ..  Job 33 "nonfree_drivers" +wt 1 tot.wt 31 
    ..  Job 34 "package_removal" +wt 1 tot.wt 32 
    ..  Job 35 "bootldr" +wt 1 tot.wt 33 
    ..  Job 36 "gummi_entries" +wt 1 tot.wt 34 
    ..  Job 37 "umount" +wt 1 tot.wt 35 
16:22:55 [6]: virtual void Calamares::JobThread::run()
    Starting job "Manage auto-mount settings" ( 1 / 37 ) 
this @0x7f5838008f90 value [email protected] disable 
16:22:56 [6]: virtual void Calamares::JobThread::run()
    Starting job "Clear all temporary mounts." ( 2 / 37 ) 
16:22:56 [6]: virtual Calamares::JobResult ClearTempMountsJob::exec()
    Opened mtab. Lines: 
16:22:56 [6]: virtual Calamares::JobResult ClearTempMountsJob::exec()
    "proc /proc proc rw,nosuid,nodev,noexec,relatime 0 0" 
16:22:56 [6]: virtual Calamares::JobResult ClearTempMountsJob::exec()
    "sys /sys sysfs rw,nosuid,nodev,noexec,relatime 0 0" 
16:22:56 [6]: virtual Calamares::JobResult ClearTempMountsJob::exec()
    "dev /dev devtmpfs rw,nosuid,relatime,size=1945632k,nr_inodes=486408,mode=755,inode64 0 0" 
16:22:56 [6]: virtual Calamares::JobResult ClearTempMountsJob::exec()
    "run /run tmpfs rw,nosuid,nodev,relatime,mode=755,inode64 0 0" 
16:22:56 [6]: virtual Calamares::JobResult ClearTempMountsJob::exec()
    "efivarfs /sys/firmware/efi/efivars efivarfs rw,nosuid,nodev,noexec,relatime 0 0" 
16:22:56 [6]: virtual Calamares::JobResult ClearTempMountsJob::exec()
    "union / aufs rw,relatime,si=927f2c0165591e46 0 0" 
16:22:56 [6]: virtual Calamares::JobResult ClearTempMountsJob::exec()
    "/dev/sda1 /bootmnt iso9660 ro,relatime,nojoliet,check=s,map=n,blocksize=2048,iocharset=default 0 0" 
16:22:56 [6]: virtual Calamares::JobResult ClearTempMountsJob::exec()
    "securityfs /sys/kernel/security securityfs rw,nosuid,nodev,noexec,relatime 0 0" 
16:22:56 [6]: virtual Calamares::JobResult ClearTempMountsJob::exec()
    "tmpfs /dev/shm tmpfs rw,nosuid,nodev,inode64 0 0" 
16:22:56 [6]: virtual Calamares::JobResult ClearTempMountsJob::exec()
    "devpts /dev/pts devpts rw,nosuid,noexec,relatime,gid=5,mode=620,ptmxmode=000 0 0" 
16:22:56 [6]: virtual Calamares::JobResult ClearTempMountsJob::exec()
    "tmpfs /sys/fs/cgroup tmpfs ro,nosuid,nodev,noexec,size=4096k,nr_inodes=1024,mode=755,inode64 0 0" 
16:22:56 [6]: virtual Calamares::JobResult ClearTempMountsJob::exec()
    "cgroup2 /sys/fs/cgroup/unified cgroup2 rw,nosuid,nodev,noexec,relatime,nsdelegate 0 0" 
16:22:56 [6]: virtual Calamares::JobResult ClearTempMountsJob::exec()
    "cgroup /sys/fs/cgroup/systemd cgroup rw,nosuid,nodev,noexec,relatime,xattr,name=systemd 0 0" 
16:22:56 [6]: virtual Calamares::JobResult ClearTempMountsJob::exec()
    "pstore /sys/fs/pstore pstore rw,nosuid,nodev,noexec,relatime 0 0" 
16:22:56 [6]: virtual Calamares::JobResult ClearTempMountsJob::exec()
    "none /sys/fs/bpf bpf rw,nosuid,nodev,noexec,relatime,mode=700 0 0" 
16:22:56 [6]: virtual Calamares::JobResult ClearTempMountsJob::exec()
    "cgroup /sys/fs/cgroup/cpuset cgroup rw,nosuid,nodev,noexec,relatime,cpuset 0 0" 
16:22:56 [6]: virtual Calamares::JobResult ClearTempMountsJob::exec()
    "cgroup /sys/fs/cgroup/net_cls,net_prio cgroup rw,nosuid,nodev,noexec,relatime,net_cls,net_prio 0 0" 
16:22:56 [6]: virtual Calamares::JobResult ClearTempMountsJob::exec()
    "cgroup /sys/fs/cgroup/cpu,cpuacct cgroup rw,nosuid,nodev,noexec,relatime,cpu,cpuacct 0 0" 
16:22:56 [6]: virtual Calamares::JobResult ClearTempMountsJob::exec()
    "cgroup /sys/fs/cgroup/freezer cgroup rw,nosuid,nodev,noexec,relatime,freezer 0 0" 
16:22:56 [6]: virtual Calamares::JobResult ClearTempMountsJob::exec()
    "cgroup /sys/fs/cgroup/devices cgroup rw,nosuid,nodev,noexec,relatime,devices 0 0" 
16:22:56 [6]: virtual Calamares::JobResult ClearTempMountsJob::exec()
    "cgroup /sys/fs/cgroup/memory cgroup rw,nosuid,nodev,noexec,relatime,memory 0 0" 
16:22:56 [6]: virtual Calamares::JobResult ClearTempMountsJob::exec()
    "cgroup /sys/fs/cgroup/perf_event cgroup rw,nosuid,nodev,noexec,relatime,perf_event 0 0" 
16:22:56 [6]: virtual Calamares::JobResult ClearTempMountsJob::exec()
    "cgroup /sys/fs/cgroup/blkio cgroup rw,nosuid,nodev,noexec,relatime,blkio 0 0" 
16:22:56 [6]: virtual Calamares::JobResult ClearTempMountsJob::exec()
    "cgroup /sys/fs/cgroup/pids cgroup rw,nosuid,nodev,noexec,relatime,pids 0 0" 
16:22:56 [6]: virtual Calamares::JobResult ClearTempMountsJob::exec()
    "systemd-1 /proc/sys/fs/binfmt_misc autofs rw,relatime,fd=30,pgrp=1,timeout=0,minproto=5,maxproto=5,direct 0 0" 
16:22:56 [6]: virtual Calamares::JobResult ClearTempMountsJob::exec()
    "hugetlbfs /dev/hugepages hugetlbfs rw,relatime,pagesize=2M 0 0" 
16:22:56 [6]: virtual Calamares::JobResult ClearTempMountsJob::exec()
    "tracefs /sys/kernel/tracing tracefs rw,nosuid,nodev,noexec,relatime 0 0" 
16:22:56 [6]: virtual Calamares::JobResult ClearTempMountsJob::exec()
    "debugfs /sys/kernel/debug debugfs rw,nosuid,nodev,noexec,relatime 0 0" 
16:22:56 [6]: virtual Calamares::JobResult ClearTempMountsJob::exec()
    "mqueue /dev/mqueue mqueue rw,nosuid,nodev,noexec,relatime 0 0" 
16:22:56 [6]: virtual Calamares::JobResult ClearTempMountsJob::exec()
    "configfs /sys/kernel/config configfs rw,nosuid,nodev,noexec,relatime 0 0" 
16:22:56 [6]: virtual Calamares::JobResult ClearTempMountsJob::exec()
    "fusectl /sys/fs/fuse/connections fusectl rw,nosuid,nodev,noexec,relatime 0 0" 
16:22:56 [6]: virtual Calamares::JobResult ClearTempMountsJob::exec()
    "tmpfs /tmp tmpfs rw,nosuid,nodev,relatime,inode64 0 0" 
16:22:56 [6]: virtual Calamares::JobResult ClearTempMountsJob::exec()
    "tmpfs /run/user/1000 tmpfs rw,nosuid,nodev,relatime,size=392292k,nr_inodes=98073,mode=700,uid=1000,gid=100,inode64 0 0" 
16:22:56 [6]: virtual Calamares::JobResult ClearTempMountsJob::exec()
    ClearTempMountsJob finished. Here's what was done:
 "" 
16:22:56 [6]: virtual void Calamares::JobThread::run()
    Starting job "Clear mounts for partitioning operations on /dev/mmcblk0" ( 3 / 37 ) 
16:22:56 [6]: QStringList getPartitionsForDevice(const QString&)
    Reading from "/proc/partitions" 
16:22:56 [6]: virtual Calamares::JobResult ClearMountsJob::exec()
    ClearMountsJob finished. Here's what was done:
 "" 
16:22:56 [6]: static CalamaresUtils::ProcessResult CalamaresUtils::System::runCommand(CalamaresUtils::System::RunLocation, const QStringList&, const QString&, const QString&, std::chrono::seconds)
    Running "env" ("udevadm", "settle") 
    ..  Finished. Exit code: 0 
16:22:56 [6]: static CalamaresUtils::ProcessResult CalamaresUtils::System::runCommand(CalamaresUtils::System::RunLocation, const QStringList&, const QString&, const QString&, std::chrono::seconds)
    Running "env" ("sync") 
    ..  Finished. Exit code: 0 
16:22:56 [6]: virtual void Calamares::JobThread::run()
    Starting job "Create new gpt partition table on /dev/mmcblk0." ( 4 / 37 ) 
16:22:56 [6]: virtual Calamares::JobResult CreatePartitionTableJob::exec()
    Creating new partition table of type "gpt" , uncommitted yet: 
16:22:56 [6]: virtual Calamares::JobResult CreatePartitionTableJob::exec()
    "unallocated" 
16:22:56 [6]: virtual Calamares::JobResult CreatePartitionTableJob::exec()
    "New Partition" 
16:22:56 [6]: virtual Calamares::JobResult CreatePartitionTableJob::exec()
    "New Partition" 
16:22:56 [6]: virtual Calamares::JobResult CreatePartitionTableJob::exec()
    lsblk:
 "NAME         MAJ:MIN RM   SIZE RO TYPE MOUNTPOINT\nloop0          7:0    0  11.2M  1 loop \nloop1          7:1    0 182.7M  1 loop \nloop2          7:2    0   2.2G  1 loop \nsda            8:0    1  14.3G  0 disk \n\xE2\x94\x9C\xE2\x94\x80sda1         8:1    1   2.4G  0 part /bootmnt\n\xE2\x94\x94\xE2\x94\x80sda2         8:2    1    64M  0 part \nmmcblk0      179:0    0  58.2G  0 disk \n\xE2\x94\x9C\xE2\x94\x80mmcblk0p1  179:1    0   512M  0 part \n\xE2\x94\x9C\xE2\x94\x80mmcblk0p2  179:2    0  55.7G  0 part \n\xE2\x94\x94\xE2\x94\x80mmcblk0p3  179:3    0     2G  0 part \nmmcblk0boot0 179:8    0     4M  1 disk \nmmcblk0boot1 179:16   0     4M  1 disk \n" 
16:22:56 [6]: virtual Calamares::JobResult CreatePartitionTableJob::exec()
    mount:
 "proc on /proc type proc (rw,nosuid,nodev,noexec,relatime)\nsys on /sys type sysfs (rw,nosuid,nodev,noexec,relatime)\ndev on /dev type devtmpfs (rw,nosuid,relatime,size=1945632k,nr_inodes=486408,mode=755,inode64)\nrun on /run type tmpfs (rw,nosuid,nodev,relatime,mode=755,inode64)\nefivarfs on /sys/firmware/efi/efivars type efivarfs (rw,nosuid,nodev,noexec,relatime)\nunion on / type aufs (rw,relatime,si=927f2c0165591e46)\n/dev/sda1 on /bootmnt type iso9660 (ro,relatime,nojoliet,check=s,map=n,blocksize=2048,iocharset=default)\nsecurityfs on /sys/kernel/security type securityfs (rw,nosuid,nodev,noexec,relatime)\ntmpfs on /dev/shm type tmpfs (rw,nosuid,nodev,inode64)\ndevpts on /dev/pts type devpts (rw,nosuid,noexec,relatime,gid=5,mode=620,ptmxmode=000)\ntmpfs on /sys/fs/cgroup type tmpfs (ro,nosuid,nodev,noexec,size=4096k,nr_inodes=1024,mode=755,inode64)\ncgroup2 on /sys/fs/cgroup/unified type cgroup2 (rw,nosuid,nodev,noexec,relatime,nsdelegate)\ncgroup on /sys/fs/cgroup/systemd type cgroup (rw,nosuid,nodev,noexec,relatime,xattr,name=systemd)\npstore on /sys/fs/pstore type pstore (rw,nosuid,nodev,noexec,relatime)\nnone on /sys/fs/bpf type bpf (rw,nosuid,nodev,noexec,relatime,mode=700)\ncgroup on /sys/fs/cgroup/cpuset type cgroup (rw,nosuid,nodev,noexec,relatime,cpuset)\ncgroup on /sys/fs/cgroup/net_cls,net_prio type cgroup (rw,nosuid,nodev,noexec,relatime,net_cls,net_prio)\ncgroup on /sys/fs/cgroup/cpu,cpuacct type cgroup (rw,nosuid,nodev,noexec,relatime,cpu,cpuacct)\ncgroup on /sys/fs/cgroup/freezer type cgroup (rw,nosuid,nodev,noexec,relatime,freezer)\ncgroup on /sys/fs/cgroup/devices type cgroup (rw,nosuid,nodev,noexec,relatime,devices)\ncgroup on /sys/fs/cgroup/memory type cgroup (rw,nosuid,nodev,noexec,relatime,memory)\ncgroup on /sys/fs/cgroup/perf_event type cgroup (rw,nosuid,nodev,noexec,relatime,perf_event)\ncgroup on /sys/fs/cgroup/blkio type cgroup (rw,nosuid,nodev,noexec,relatime,blkio)\ncgroup on /sys/fs/cgroup/pids type cgroup (rw,nosuid,nodev,noexec,relatime,pids)\nsystemd-1 on /proc/sys/fs/binfmt_misc type autofs (rw,relatime,fd=30,pgrp=1,timeout=0,minproto=5,maxproto=5,direct)\nhugetlbfs on /dev/hugepages type hugetlbfs (rw,relatime,pagesize=2M)\ntracefs on /sys/kernel/tracing type tracefs (rw,nosuid,nodev,noexec,relatime)\ndebugfs on /sys/kernel/debug type debugfs (rw,nosuid,nodev,noexec,relatime)\nmqueue on /dev/mqueue type mqueue (rw,nosuid,nodev,noexec,relatime)\nconfigfs on /sys/kernel/config type configfs (rw,nosuid,nodev,noexec,relatime)\nfusectl on /sys/fs/fuse/connections type fusectl (rw,nosuid,nodev,noexec,relatime)\ntmpfs on /tmp type tmpfs (rw,nosuid,nodev,relatime,inode64)\ntmpfs on /run/user/1000 type tmpfs (rw,nosuid,nodev,relatime,size=392292k,nr_inodes=98073,mode=700,uid=1000,gid=100,inode64)\n" 
16:22:57 [6]: virtual void Calamares::JobThread::run()
    Starting job "Create new 300MiB partition on /dev/mmcblk0 (mmcblk0)." ( 5 / 37 ) 
16:22:59 [6]: virtual void Calamares::JobThread::run()
    Starting job "Set flags on partition /dev/mmcblk0p1." ( 6 / 37 ) 
16:22:59 [6]: virtual Calamares::JobResult SetPartFlagsJob::exec()
    Setting flags on "/dev/mmcblk0" partition "/dev/mmcblk0p1" to QFlags(0x1) 
16:22:59 [6]: virtual void Calamares::JobThread::run()
    Starting job "Create new 59337MiB partition on /dev/mmcblk0 (mmcblk0) with entries root." ( 7 / 37 ) 
16:23:07 [6]: virtual void Calamares::JobThread::run()
    Starting job "Set partition information" ( 8 / 37 ) 
16:23:07 [6]: QVariantList FillGlobalStorageJob::createPartitionList() const
    Building partition information map 
    ..  partitions on "/dev/mmcblk0" 
    ..  mapping for "" "unallocated" 
     partlabel :   "" 
     partuuid :   "" 
     parttype :   "" 
     partattrs :   "0" 
     mountPoint: :   "" 
     fs: :   "unknown" 
     fsName :   "unknown" 
     uuid :   "" 
     claimed :   "false" 
    ..  mapping for "/dev/mmcblk0p1" "/dev/mmcblk0p1" 
     partlabel :   "" 
     partuuid :   "" 
     parttype :   "" 
     partattrs :   "0" 
     mountPoint: :   "/boot" 
     fs: :   "fat32" 
     fsName :   "fat32" 
     uuid :   "8320-53B2" 
     claimed :   "true" 
    ..  mapping for "/dev/mmcblk0p2" "/dev/mmcblk0p2" 
     partlabel :   "root" 
     partuuid :   "" 
     parttype :   "" 
     partattrs :   "140017075893344" 
     mountPoint: :   "/" 
     fs: :   "xfs" 
     fsName :   "xfs" 
     uuid :   "1a3ab795-2f6a-43e8-b674-fd96f208f039" 
     claimed :   "true" 
16:23:07 [6]: virtual Calamares::JobResult FillGlobalStorageJob::exec()
    Saving partition information map to GlobalStorage["partitions"] 
16:23:07 [6]: virtual Calamares::JobResult FillGlobalStorageJob::exec()
    FillGlobalStorageJob writing empty bootLoader value 
16:23:07 [6]: virtual void Calamares::JobThread::run()
    Starting job "Manage auto-mount settings" ( 9 / 37 ) 
this @0x7f5838008f90 value [email protected] restore 
16:23:07 [6]: virtual void Calamares::JobThread::run()
    Starting job "mount" ( 10 / 37 ) 
16:23:07 [6]: virtual Calamares::JobResult Calamares::PythonJob::exec()
    Job file "/usr/lib/calamares/modules/mount/main.py" 
16:23:07 [6]: boost::python::api::object CalamaresPython::gettext_path()
    Determining gettext path from ("/home/live", "/usr/bin", "/usr/share/locale") 
    ..  Found "en_US" in "/usr/share/locale/en_US" 
    ..  Job description from pretty_name "mount" = "Mounting partitions." 
16:23:07 [6]: static CalamaresUtils::ProcessResult CalamaresUtils::System::runCommand(CalamaresUtils::System::RunLocation, const QStringList&, const QString&, const QString&, std::chrono::seconds)
    Running "env" ("mount", "-t", "xfs", "/dev/mmcblk0p2", "/tmp/calamares-root-vxvyulc_/") 
    ..  Finished. Exit code: 0 
16:23:07 [6]: static CalamaresUtils::ProcessResult CalamaresUtils::System::runCommand(CalamaresUtils::System::RunLocation, const QStringList&, const QString&, const QString&, std::chrono::seconds)
    Running "env" ("udevadm", "settle") 
    ..  Finished. Exit code: 0 
16:23:07 [6]: static CalamaresUtils::ProcessResult CalamaresUtils::System::runCommand(CalamaresUtils::System::RunLocation, const QStringList&, const QString&, const QString&, std::chrono::seconds)
    Running "env" ("sync") 
    ..  Finished. Exit code: 0 
16:23:07 [6]: static CalamaresUtils::ProcessResult CalamaresUtils::System::runCommand(CalamaresUtils::System::RunLocation, const QStringList&, const QString&, const QString&, std::chrono::seconds)
    Running "env" ("mount", "-t", "vfat", "/dev/mmcblk0p1", "/tmp/calamares-root-vxvyulc_/boot") 
    ..  Finished. Exit code: 0 
16:23:07 [6]: static CalamaresUtils::ProcessResult CalamaresUtils::System::runCommand(CalamaresUtils::System::RunLocation, const QStringList&, const QString&, const QString&, std::chrono::seconds)
    Running "env" ("udevadm", "settle") 
    ..  Finished. Exit code: 0 
16:23:07 [6]: static CalamaresUtils::ProcessResult CalamaresUtils::System::runCommand(CalamaresUtils::System::RunLocation, const QStringList&, const QString&, const QString&, std::chrono::seconds)
    Running "env" ("sync") 
    ..  Finished. Exit code: 0 
16:23:07 [6]: static CalamaresUtils::ProcessResult CalamaresUtils::System::runCommand(CalamaresUtils::System::RunLocation, const QStringList&, const QString&, const QString&, std::chrono::seconds)
    Running "env" ("mount", "-o", "bind", "/dev", "/tmp/calamares-root-vxvyulc_/dev") 
    ..  Finished. Exit code: 0 
16:23:07 [6]: static CalamaresUtils::ProcessResult CalamaresUtils::System::runCommand(CalamaresUtils::System::RunLocation, const QStringList&, const QString&, const QString&, std::chrono::seconds)
    Running "env" ("udevadm", "settle") 
    ..  Finished. Exit code: 0 
16:23:07 [6]: static CalamaresUtils::ProcessResult CalamaresUtils::System::runCommand(CalamaresUtils::System::RunLocation, const QStringList&, const QString&, const QString&, std::chrono::seconds)
    Running "env" ("sync") 
    ..  Finished. Exit code: 0 
16:23:07 [6]: static CalamaresUtils::ProcessResult CalamaresUtils::System::runCommand(CalamaresUtils::System::RunLocation, const QStringList&, const QString&, const QString&, std::chrono::seconds)
    Running "env" ("mount", "-t", "proc", "proc", "/tmp/calamares-root-vxvyulc_/proc") 
    ..  Finished. Exit code: 0 
16:23:07 [6]: static CalamaresUtils::ProcessResult CalamaresUtils::System::runCommand(CalamaresUtils::System::RunLocation, const QStringList&, const QString&, const QString&, std::chrono::seconds)
    Running "env" ("udevadm", "settle") 
    ..  Finished. Exit code: 0 
16:23:07 [6]: static CalamaresUtils::ProcessResult CalamaresUtils::System::runCommand(CalamaresUtils::System::RunLocation, const QStringList&, const QString&, const QString&, std::chrono::seconds)
    Running "env" ("sync") 
    ..  Finished. Exit code: 0 
16:23:07 [6]: static CalamaresUtils::ProcessResult CalamaresUtils::System::runCommand(CalamaresUtils::System::RunLocation, const QStringList&, const QString&, const QString&, std::chrono::seconds)
    Running "env" ("mount", "-t", "tmpfs", "tmpfs", "/tmp/calamares-root-vxvyulc_/run") 
    ..  Finished. Exit code: 0 
16:23:07 [6]: static CalamaresUtils::ProcessResult CalamaresUtils::System::runCommand(CalamaresUtils::System::RunLocation, const QStringList&, const QString&, const QString&, std::chrono::seconds)
    Running "env" ("udevadm", "settle") 
    ..  Finished. Exit code: 0 
16:23:07 [6]: static CalamaresUtils::ProcessResult CalamaresUtils::System::runCommand(CalamaresUtils::System::RunLocation, const QStringList&, const QString&, const QString&, std::chrono::seconds)
    Running "env" ("sync") 
    ..  Finished. Exit code: 0 
16:23:07 [6]: static CalamaresUtils::ProcessResult CalamaresUtils::System::runCommand(CalamaresUtils::System::RunLocation, const QStringList&, const QString&, const QString&, std::chrono::seconds)
    Running "env" ("mount", "-o", "bind", "/run/udev", "/tmp/calamares-root-vxvyulc_/run/udev") 
    ..  Finished. Exit code: 0 
16:23:07 [6]: static CalamaresUtils::ProcessResult CalamaresUtils::System::runCommand(CalamaresUtils::System::RunLocation, const QStringList&, const QString&, const QString&, std::chrono::seconds)
    Running "env" ("udevadm", "settle") 
    ..  Finished. Exit code: 0 
16:23:07 [6]: static CalamaresUtils::ProcessResult CalamaresUtils::System::runCommand(CalamaresUtils::System::RunLocation, const QStringList&, const QString&, const QString&, std::chrono::seconds)
    Running "env" ("sync") 
    ..  Finished. Exit code: 0 
16:23:07 [6]: static CalamaresUtils::ProcessResult CalamaresUtils::System::runCommand(CalamaresUtils::System::RunLocation, const QStringList&, const QString&, const QString&, std::chrono::seconds)
    Running "env" ("mount", "-t", "sysfs", "sys", "/tmp/calamares-root-vxvyulc_/sys") 
    ..  Finished. Exit code: 0 
16:23:08 [6]: static CalamaresUtils::ProcessResult CalamaresUtils::System::runCommand(CalamaresUtils::System::RunLocation, const QStringList&, const QString&, const QString&, std::chrono::seconds)
    Running "env" ("udevadm", "settle") 
    ..  Finished. Exit code: 0 
16:23:08 [6]: static CalamaresUtils::ProcessResult CalamaresUtils::System::runCommand(CalamaresUtils::System::RunLocation, const QStringList&, const QString&, const QString&, std::chrono::seconds)
    Running "env" ("sync") 
    ..  Finished. Exit code: 0 
16:23:08 [6]: static CalamaresUtils::ProcessResult CalamaresUtils::System::runCommand(CalamaresUtils::System::RunLocation, const QStringList&, const QString&, const QString&, std::chrono::seconds)
    Running "env" ("mount", "-t", "efivarfs", "efivarfs", "/tmp/calamares-root-vxvyulc_/sys/firmware/efi/efivars") 
    ..  Finished. Exit code: 0 
16:23:08 [6]: static CalamaresUtils::ProcessResult CalamaresUtils::System::runCommand(CalamaresUtils::System::RunLocation, const QStringList&, const QString&, const QString&, std::chrono::seconds)
    Running "env" ("udevadm", "settle") 
    ..  Finished. Exit code: 0 
16:23:08 [6]: static CalamaresUtils::ProcessResult CalamaresUtils::System::runCommand(CalamaresUtils::System::RunLocation, const QStringList&, const QString&, const QString&, std::chrono::seconds)
    Running "env" ("sync") 
    ..  Finished. Exit code: 0 
16:23:08 [6]: virtual void Calamares::JobThread::run()
    Starting job "unpackfs" ( 11 / 37 ) 
16:23:08 [6]: virtual Calamares::JobResult Calamares::PythonJob::exec()
    Job file "/usr/lib/calamares/modules/unpackfs/main.py" 
16:23:08 [6]: boost::python::api::object CalamaresPython::gettext_path()
    Determining gettext path from ("/home/live", "/usr/bin", "/usr/share/locale") 
    ..  Found "en_US" in "/usr/share/locale/en_US" 
    ..  Job description from pretty_name "unpackfs" = "Filling up filesystems." 
16:23:08 [6]: static CalamaresUtils::ProcessResult CalamaresUtils::System::runCommand(CalamaresUtils::System::RunLocation, const QStringList&, const QString&, const QString&, std::chrono::seconds)
    Running "env" ("mount", "-t", "squashfs", "-o", "loop", "/bootmnt/kdeos/x86_64/root-image.sqfs", "/tmp/tmpto_ggtrz/root-image") 
    ..  Finished. Exit code: 0 output:
 mount: /tmp/tmpto_ggtrz/root-image: WARNING: source write-protected, mounted read-only.
16:23:08 [6]: static CalamaresUtils::ProcessResult CalamaresUtils::System::runCommand(CalamaresUtils::System::RunLocation, const QStringList&, const QString&, const QString&, std::chrono::seconds)
    Running "env" ("udevadm", "settle") 
    ..  Finished. Exit code: 0 
16:23:08 [6]: static CalamaresUtils::ProcessResult CalamaresUtils::System::runCommand(CalamaresUtils::System::RunLocation, const QStringList&, const QString&, const QString&, std::chrono::seconds)
    Running "env" ("sync") 
    ..  Finished. Exit code: 0 
16:28:33 [6]: virtual void Calamares::JobThread::run()
    Starting job "Generate machine-id." ( 12 / 37 ) 
16:28:33 [6]: static CalamaresUtils::ProcessResult CalamaresUtils::System::runCommand(CalamaresUtils::System::RunLocation, const QStringList&, const QString&, const QString&, std::chrono::seconds)
    Running "chroot" ("/tmp/calamares-root-vxvyulc_", "systemd-machine-id-setup") 
    ..  Finished. Exit code: 0 output:
 Initializing machine ID from random generator.
16:28:33 [6]: static CalamaresUtils::ProcessResult CalamaresUtils::System::runCommand(CalamaresUtils::System::RunLocation, const QStringList&, const QString&, const QString&, std::chrono::seconds)
    Running "chroot" ("/tmp/calamares-root-vxvyulc_", "ln", "-sf", "/etc/machine-id", "/var/lib/dbus/machine-id") 
    ..  Finished. Exit code: 0 
16:28:33 [6]: virtual void Calamares::JobThread::run()
    Starting job "fstab" ( 13 / 37 ) 
16:28:33 [6]: virtual Calamares::JobResult Calamares::PythonJob::exec()
    Job file "/usr/lib/calamares/modules/fstab/main.py" 
16:28:33 [6]: boost::python::api::object CalamaresPython::gettext_path()
    Determining gettext path from ("/home/live", "/usr/bin", "/usr/share/locale") 
    ..  Found "en_US" in "/usr/share/locale/en_US" 
    ..  Job description from pretty_name "fstab" = "Writing fstab." 
16:28:33 [6]: virtual void Calamares::JobThread::run()
    Starting job "Set timezone to America/***" ( 14 / 37 ) 
16:28:33 [6]: static CalamaresUtils::ProcessResult CalamaresUtils::System::runCommand(CalamaresUtils::System::RunLocation, const QStringList&, const QString&, const QString&, std::chrono::seconds)
    Running "chroot" ("/tmp/calamares-root-vxvyulc_", "rm", "-f", "/etc/localtime") 
    ..  Finished. Exit code: 0 
16:28:33 [6]: static CalamaresUtils::ProcessResult CalamaresUtils::System::runCommand(CalamaresUtils::System::RunLocation, const QStringList&, const QString&, const QString&, std::chrono::seconds)
    Running "chroot" ("/tmp/calamares-root-vxvyulc_", "ln", "-s", "/usr/share/zoneinfo/America/***", "/etc/localtime") 
    ..  Finished. Exit code: 0 
16:28:33 [6]: virtual void Calamares::JobThread::run()
    Starting job "Set keyboard model to pc105, layout to us-" ( 15 / 37 ) 
16:28:33 [6]: virtual Calamares::JobResult SetKeyboardLayoutJob::exec()
    Executing SetKeyboardLayoutJob 
16:28:33 [6]: bool SetKeyboardLayoutJob::writeVConsoleData(const QString&, const QString&) const
    Writing vconsole data to "/tmp/calamares-root-vxvyulc_/etc/vconsole.conf" 
16:28:33 [6]: QString SetKeyboardLayoutJob::findConvertedKeymap(const QString&) const
    Looking for converted keymap in "/tmp/calamares-root-vxvyulc_/lib/kbd/keymaps/xkb" 
16:28:33 [6]: QString findLegacyKeymap(const QString&, const QString&, const QString&)
    Looking for legacy keymap "us" "pc105" "" in QRC 
    ..  Found legacy keymap "us" with score 11 
    ..  Found legacy keymap "us-acentos" with score 11 
    ..  Found legacy keymap "dvorak" with score 11 
    ..  Found legacy keymap "dvorak" with score 11 
    ..  Written KEYMAP= "us" to vconsole.conf 0 
16:28:33 [6]: bool SetKeyboardLayoutJob::writeX11Data(const QString&) const
    Writing X11 configuration to "/tmp/calamares-root-vxvyulc_/etc/X11/xorg.conf.d/00-keyboard.conf" 
    ..  Written XkbLayout "us" ; XkbModel "pc105" ; XkbVariant "" to X.org file "/tmp/calamares-root-vxvyulc_/etc/X11/xorg.conf.d/00-keyboard.conf" 0 
16:28:33 [6]: bool SetKeyboardLayoutJob::writeDefaultKeyboardData(const QString&) const
    Writing default keyboard data to "/tmp/calamares-root-vxvyulc_/etc/default/keyboard" 
    ..  Written XKBMODEL "pc105" ; XKBLAYOUT "us" ; XKBVARIANT "" to /etc/default/keyboard file "/tmp/calamares-root-vxvyulc_/etc/default/keyboard" 0 
16:28:33 [6]: virtual void Calamares::JobThread::run()
    Starting job "localecfg" ( 16 / 37 ) 
16:28:33 [6]: virtual Calamares::JobResult Calamares::PythonJob::exec()
    Job file "/usr/lib/calamares/modules/localecfg/main.py" 
16:28:33 [6]: boost::python::api::object CalamaresPython::gettext_path()
    Determining gettext path from ("/home/live", "/usr/bin", "/usr/share/locale") 
    ..  Found "en_US" in "/usr/share/locale/en_US" 
    ..  Job description from pretty_name "localecfg" = "Configuring locales." 
[PYTHON JOB]:  "Restored backup /tmp/calamares-root-vxvyulc_/etc/locale.gen.bak -> /tmp/calamares-root-vxvyulc_/etc/locale.gen" 
16:28:33 [6]: static CalamaresUtils::ProcessResult CalamaresUtils::System::runCommand(CalamaresUtils::System::RunLocation, const QStringList&, const QString&, const QString&, std::chrono::seconds)
    Running "chroot" ("/tmp/calamares-root-vxvyulc_", "locale-gen") 
    ..  Finished. Exit code: 0 output:
 Generating locales...
  en_US.UTF-8... done
Generation complete.
[PYTHON JOB]:  "/tmp/calamares-root-vxvyulc_/etc/locale.gen done" 
[PYTHON JOB]:  "/tmp/calamares-root-vxvyulc_/etc/locale.conf done" 
[PYTHON JOB]:  "/tmp/calamares-root-vxvyulc_/etc/default done" 
16:28:35 [6]: virtual void Calamares::JobThread::run()
    Starting job "Configuring LUKS key file." ( 17 / 37 ) 
16:28:35 [6]: virtual Calamares::JobResult LuksBootKeyFileJob::exec()
    There are 0 LUKS partitions 
    ..  Nothing to do for LUKS. 
16:28:35 [6]: virtual void Calamares::JobThread::run()
    Starting job "luksopenswaphookcfg" ( 18 / 37 ) 
16:28:35 [6]: virtual Calamares::JobResult Calamares::PythonJob::exec()
    Job file "/usr/lib/calamares/modules/luksopenswaphookcfg/main.py" 
16:28:35 [6]: boost::python::api::object CalamaresPython::gettext_path()
    Determining gettext path from ("/home/live", "/usr/bin", "/usr/share/locale") 
    ..  Found "en_US" in "/usr/share/locale/en_US" 
    ..  Job description from pretty_name "luksopenswaphookcfg" = "Configuring encrypted swap." 
16:28:35 [6]: virtual void Calamares::JobThread::run()
    Starting job "initcpiocfg" ( 19 / 37 ) 
16:28:35 [6]: virtual Calamares::JobResult Calamares::PythonJob::exec()
    Job file "/usr/lib/calamares/modules/initcpiocfg/main.py" 
16:28:35 [6]: boost::python::api::object CalamaresPython::gettext_path()
    Determining gettext path from ("/home/live", "/usr/bin", "/usr/share/locale") 
    ..  Found "en_US" in "/usr/share/locale/en_US" 
    ..  Job description from pretty_name "initcpiocfg" = "Configuring mkinitcpio." 
16:28:35 [6]: static CalamaresUtils::ProcessResult CalamaresUtils::System::runCommand(CalamaresUtils::System::RunLocation, const QStringList&, const QString&, const QString&, std::chrono::seconds)
    Running "chroot" ("/tmp/calamares-root-vxvyulc_", "sh", "-c", "which plymouth") 
    ..  Target cmd: ("sh", "-c", "which plymouth") Exit code: 1 output:
 which: no plymouth in (/usr/local/bin:/usr/bin:/bin:/usr/local/sbin:/usr/sbin:/sbin:/usr/bin/site_perl:/usr/bin/vendor_perl:/usr/bin/core_perl)
[PYTHON JOB]:  "which plymouth exit code: 1" 
16:28:35 [6]: virtual void Calamares::JobThread::run()
    Starting job "Creating initramfs with mkinitcpio." ( 20 / 37 ) 
16:28:35 [6]: virtual Calamares::JobResult InitcpioJob::exec()
    Updating initramfs with kernel "linux" 
16:28:35 [6]: static CalamaresUtils::ProcessResult CalamaresUtils::System::runCommand(CalamaresUtils::System::RunLocation, const QStringList&, const QString&, const QString&, std::chrono::seconds)
    Running "chroot" ("/tmp/calamares-root-vxvyulc_", "mkinitcpio", "-p", "linux") 
    ..  Finished. Exit code: 0 output:
 ==> Building image from preset: /etc/mkinitcpio.d/linux.preset: 'default'
  -> -k /boot/vmlinuz-linux -c /etc/mkinitcpio.conf -g /boot/initramfs-linux.img
==> Starting build: 5.11.16-1
  -> Running build hook: [base]
  -> Running build hook: [udev]
  -> Running build hook: [autodetect]
  -> Running build hook: [modconf]
  -> Running build hook: [block]
==> WARNING: Possibly missing firmware for module: xhci_pci
  -> Running build hook: [keyboard]
  -> Running build hook: [keymap]
  -> Running build hook: [filesystems]
  -> Running build hook: [fsck]
==> Generating module dependencies
==> Creating gzip-compressed initcpio image: /boot/initramfs-linux.img
==> Image generation successful
==> Building image from preset: /etc/mkinitcpio.d/linux.preset: 'fallback'
  -> -k /boot/vmlinuz-linux -c /etc/mkinitcpio.conf -g /boot/initramfs-linux-fallback.img -S autodetect
==> Starting build: 5.11.16-1
  -> Running build hook: [base]
  -> Running build hook: [udev]
  -> Running build hook: [modconf]
  -> Running build hook: [block]
==> WARNING: Possibly missing firmware for module: aic94xx
==> WARNING: Possibly missing firmware for module: wd719x
==> WARNING: Possibly missing firmware for module: xhci_pci
  -> Running build hook: [keyboard]
  -> Running build hook: [keymap]
  -> Running build hook: [filesystems]
  -> Running build hook: [fsck]
==> Generating module dependencies
==> Creating gzip-compressed initcpio image: /boot/initramfs-linux-fallback.img
==> Image generation successful
16:28:51 [6]: virtual void Calamares::JobThread::run()
    Starting job "Configure <pre>sudo</pre> users." ( 21 / 37 ) 
16:28:51 [6]: virtual void Calamares::JobThread::run()
    Starting job "Preparing groups." ( 22 / 37 ) 
16:28:51 [6]: static CalamaresUtils::ProcessResult CalamaresUtils::System::runCommand(CalamaresUtils::System::RunLocation, const QStringList&, const QString&, const QString&, std::chrono::seconds)
    Running "chroot" ("/tmp/calamares-root-vxvyulc_", "groupadd", "lpadmin") 
    ..  Finished. Exit code: 0 
16:28:51 [6]: virtual void Calamares::JobThread::run()
    Starting job "Create user kate" ( 23 / 37 ) 
16:28:51 [6]: virtual Calamares::JobResult CreateUserJob::exec()
    [CREATEUSER]: creating user 
16:28:51 [6]: static CalamaresUtils::ProcessResult CalamaresUtils::System::runCommand(CalamaresUtils::System::RunLocation, const QStringList&, const QString&, const QString&, std::chrono::seconds)
    Running "chroot" ("/tmp/calamares-root-vxvyulc_", "useradd", "-m", "-U", "-s", "/bin/bash", "-c", "Kate", "kate") 
    ..  Finished. Exit code: 0 
16:28:51 [6]: static CalamaresUtils::ProcessResult CalamaresUtils::System::runCommand(CalamaresUtils::System::RunLocation, const QStringList&, const QString&, const QString&, std::chrono::seconds)
    Running "chroot" "/tmp/calamares-root-vxvyulc_" "usermod" "-aG" "users,lp,video,network,storage,wheel,audio,lpadmin" "kate" 
    ..  Finished. Exit code: 0 
16:28:51 [6]: static CalamaresUtils::ProcessResult CalamaresUtils::System::runCommand(CalamaresUtils::System::RunLocation, const QStringList&, const QString&, const QString&, std::chrono::seconds)
    Running "chroot" ("/tmp/calamares-root-vxvyulc_", "chown", "-R", "kate:kate", "/home/kate") 
    ..  Finished. Exit code: 0 
16:28:51 [6]: virtual void Calamares::JobThread::run()
    Starting job "Set password for user kate" ( 24 / 37 ) 
16:28:51 [6]: static CalamaresUtils::ProcessResult CalamaresUtils::System::runCommand(CalamaresUtils::System::RunLocation, const QStringList&, const QString&, const QString&, std::chrono::seconds)
    Running "chroot" "/tmp/calamares-root-vxvyulc_" "usermod" "-p" <password> "kate" 
    ..  Finished. Exit code: 0 
16:28:51 [6]: virtual void Calamares::JobThread::run()
    Starting job "Set password for user root" ( 25 / 37 ) 
16:28:51 [6]: static CalamaresUtils::ProcessResult CalamaresUtils::System::runCommand(CalamaresUtils::System::RunLocation, const QStringList&, const QString&, const QString&, std::chrono::seconds)
    Running "chroot" "/tmp/calamares-root-vxvyulc_" "usermod" "-p" <password> "root" 
    ..  Finished. Exit code: 0 
16:28:51 [6]: virtual void Calamares::JobThread::run()
    Starting job "Set hostname Huxley" ( 26 / 37 ) 
16:28:51 [6]: virtual void Calamares::JobThread::run()
    Starting job "networkcfg" ( 27 / 37 ) 
16:28:51 [6]: virtual Calamares::JobResult Calamares::PythonJob::exec()
    Job file "/usr/lib/calamares/modules/networkcfg/main.py" 
16:28:51 [6]: boost::python::api::object CalamaresPython::gettext_path()
    Determining gettext path from ("/home/live", "/usr/bin", "/usr/share/locale") 
    ..  Found "en_US" in "/usr/share/locale/en_US" 
    ..  Job description from pretty_name "networkcfg" = "Saving network configuration." 
16:28:51 [6]: virtual void Calamares::JobThread::run()
    Starting job "services" ( 28 / 37 ) 
16:28:51 [6]: virtual Calamares::JobResult Calamares::PythonJob::exec()
    Job file "/usr/lib/calamares/modules/services/main.py" 
    ..  Job description from __doc__ "services" = "Setup systemd services" 
16:28:51 [6]: static CalamaresUtils::ProcessResult CalamaresUtils::System::runCommand(CalamaresUtils::System::RunLocation, const QStringList&, const QString&, const QString&, std::chrono::seconds)
    Running "chroot" ("/tmp/calamares-root-vxvyulc_", "systemctl", "enable", "NetworkManager.service") 
    ..  Finished. Exit code: 0 
16:28:51 [6]: static CalamaresUtils::ProcessResult CalamaresUtils::System::runCommand(CalamaresUtils::System::RunLocation, const QStringList&, const QString&, const QString&, std::chrono::seconds)
    Running "chroot" ("/tmp/calamares-root-vxvyulc_", "systemctl", "enable", "org.cups.cupsd.service") 
    ..  Finished. Exit code: 0 
16:28:51 [6]: static CalamaresUtils::ProcessResult CalamaresUtils::System::runCommand(CalamaresUtils::System::RunLocation, const QStringList&, const QString&, const QString&, std::chrono::seconds)
    Running "chroot" ("/tmp/calamares-root-vxvyulc_", "systemctl", "enable", "graphical.target") 
    ..  Finished. Exit code: 0 output:
 The unit files have no installation config (WantedBy=, RequiredBy=, Also=,
Alias= settings in the [Install] section, and DefaultInstance= for template
units). This means they are not meant to be enabled using systemctl.
 
Possible reasons for having this kind of units are:
* A unit may be statically enabled by being symlinked from another unit's
  .wants/ or .requires/ directory.
* A unit's purpose may be to act as a helper for some other unit which has
  a requirement dependency on it.
* A unit may be started when needed via activation (socket, path, timer,
  D-Bus, udev, scripted systemctl call, ...).
* In case of template units, the unit is meant to be enabled with some
  instance name specified.
16:28:51 [6]: static CalamaresUtils::ProcessResult CalamaresUtils::System::runCommand(CalamaresUtils::System::RunLocation, const QStringList&, const QString&, const QString&, std::chrono::seconds)
    Running "chroot" ("/tmp/calamares-root-vxvyulc_", "systemctl", "disable", "pacman-init.service") 
    ..  Finished. Exit code: 0 output:
 Failed to disable unit, unit pacman-init.service does not exist.
16:28:51 [6]: virtual void Calamares::JobThread::run()
    Starting job "grubconf" ( 29 / 37 ) 
16:28:51 [6]: virtual Calamares::JobResult Calamares::PythonJob::exec()
    Job file "/usr/lib/calamares/modules/grubconf/main.py" 
16:28:51 [6]: virtual void Calamares::JobThread::run()
    Starting job "kdm_sddm" ( 30 / 37 ) 
16:28:51 [6]: virtual Calamares::JobResult Calamares::PythonJob::exec()
    Job file "/usr/lib/calamares/modules/kdm_sddm/main.py" 
    ..  Job description from __doc__ "kdm_sddm" = "Configure display managers" 
16:28:51 [2]: boost::python::api::object CalamaresPython::GlobalStoragePythonWrapper::value(const string&) const
    WARNING: Unknown GS key autoLoginUser 
16:28:51 [6]: virtual void Calamares::JobThread::run()
    Starting job "userkf5" ( 31 / 37 ) 
16:28:51 [6]: virtual Calamares::JobResult Calamares::PythonJob::exec()
    Job file "/usr/lib/calamares/modules/userkf5/main.py" 
    ..  Job description from __doc__ "userkf5" = "Create Distribution specific settings for users" 
16:28:51 [6]: static CalamaresUtils::ProcessResult CalamaresUtils::System::runCommand(CalamaresUtils::System::RunLocation, const QStringList&, const QString&, const QString&, std::chrono::seconds)
    Running "chroot" ("/tmp/calamares-root-vxvyulc_", "/usr/bin/mkdir", "-p", "/home/kate/Desktop") 
    ..  Finished. Exit code: 0 
16:28:51 [6]: static CalamaresUtils::ProcessResult CalamaresUtils::System::runCommand(CalamaresUtils::System::RunLocation, const QStringList&, const QString&, const QString&, std::chrono::seconds)
    Running "chroot" ("/tmp/calamares-root-vxvyulc_", "/usr/bin/mkdir", "-p", "/home/kate/.config") 
    ..  Finished. Exit code: 0 
16:28:51 [6]: static CalamaresUtils::ProcessResult CalamaresUtils::System::runCommand(CalamaresUtils::System::RunLocation, const QStringList&, const QString&, const QString&, std::chrono::seconds)
    Running "chroot" ("/tmp/calamares-root-vxvyulc_", "/usr/bin/mkdir", "-p", "/home/kate/.local/share/applications/") 
    ..  Finished. Exit code: 0 
16:28:51 [6]: static CalamaresUtils::ProcessResult CalamaresUtils::System::runCommand(CalamaresUtils::System::RunLocation, const QStringList&, const QString&, const QString&, std::chrono::seconds)
    Running "chroot" ("/tmp/calamares-root-vxvyulc_", "/usr/bin/mkdir", "-p", "/home/kate/.local/share/konqueror") 
    ..  Finished. Exit code: 0 
16:28:51 [6]: static CalamaresUtils::ProcessResult CalamaresUtils::System::runCommand(CalamaresUtils::System::RunLocation, const QStringList&, const QString&, const QString&, std::chrono::seconds)
    Running "chroot" ("/tmp/calamares-root-vxvyulc_", "/usr/bin/mkdir", "-p", "/home/kate/.local/share/konsole") 
    ..  Finished. Exit code: 0 
16:28:51 [6]: static CalamaresUtils::ProcessResult CalamaresUtils::System::runCommand(CalamaresUtils::System::RunLocation, const QStringList&, const QString&, const QString&, std::chrono::seconds)
    Running "chroot" ("/tmp/calamares-root-vxvyulc_", "/usr/bin/mkdir", "-p", "/home/kate/.config/autostart") 
    ..  Finished. Exit code: 0 
16:28:51 [6]: static CalamaresUtils::ProcessResult CalamaresUtils::System::runCommand(CalamaresUtils::System::RunLocation, const QStringList&, const QString&, const QString&, std::chrono::seconds)
    Running "chroot" ("/tmp/calamares-root-vxvyulc_", "/usr/bin/mkdir", "-p", "/home/kate/.config/plasma-workspace/env") 
    ..  Finished. Exit code: 0 
16:28:51 [6]: static CalamaresUtils::ProcessResult CalamaresUtils::System::runCommand(CalamaresUtils::System::RunLocation, const QStringList&, const QString&, const QString&, std::chrono::seconds)
    Running "chroot" ("/tmp/calamares-root-vxvyulc_", "/usr/bin/mkdir", "-p", "/home/kate/.config/Kvantum") 
    ..  Finished. Exit code: 0 
16:28:51 [6]: static CalamaresUtils::ProcessResult CalamaresUtils::System::runCommand(CalamaresUtils::System::RunLocation, const QStringList&, const QString&, const QString&, std::chrono::seconds)
    Running "chroot" ("/tmp/calamares-root-vxvyulc_", "chown", "-R", "kate:users", "/home/kate") 
    ..  Finished. Exit code: 0 
16:28:51 [6]: static CalamaresUtils::ProcessResult CalamaresUtils::System::runCommand(CalamaresUtils::System::RunLocation, const QStringList&, const QString&, const QString&, std::chrono::seconds)
    Running "chroot" ("/tmp/calamares-root-vxvyulc_", "setcap", "cap_net_raw=ep", "/usr/bin/ping") 
    ..  Finished. Exit code: 0 
16:28:52 [6]: virtual void Calamares::JobThread::run()
    Starting job "driver_cleanup" ( 32 / 37 ) 
16:28:52 [6]: virtual Calamares::JobResult Calamares::PythonJob::exec()
    Job file "/usr/lib/calamares/modules/driver_cleanup/main.py" 
    ..  Job description from __doc__ "driver_cleanup" = "Clean up unused drivers" 
[PYTHON JOB]:  "  Driver: \"i915\"\n" 
16:28:52 [6]: static CalamaresUtils::ProcessResult CalamaresUtils::System::runCommand(CalamaresUtils::System::RunLocation, const QStringList&, const QString&, const QString&, std::chrono::seconds)
    Running "chroot" ("/tmp/calamares-root-vxvyulc_", "pacman", "-R", "--noconfirm", "xf86-video-nouveau") 
    ..  Target cmd: ("pacman", "-R", "--noconfirm", "xf86-video-nouveau") Exit code: 1 output:
 error: target not found: xf86-video-nouveau
16:28:52 [6]: static CalamaresUtils::ProcessResult CalamaresUtils::System::runCommand(CalamaresUtils::System::RunLocation, const QStringList&, const QString&, const QString&, std::chrono::seconds)
    Running "chroot" ("/tmp/calamares-root-vxvyulc_", "pacman", "-R", "--noconfirm", "xf86-video-amdgpu") 
    ..  Finished. Exit code: 0 output:
 checking dependencies...

Package (1)        Old Version  Net Change

xf86-video-amdgpu  19.1.0-1      -0.16 MiB

Total Removed Size:  0.16 MiB

:: Do you want to remove these packages? [Y/n] 
:: Processing package changes...
removing xf86-video-amdgpu...
16:28:52 [6]: static CalamaresUtils::ProcessResult CalamaresUtils::System::runCommand(CalamaresUtils::System::RunLocation, const QStringList&, const QString&, const QString&, std::chrono::seconds)
    Running "chroot" ("/tmp/calamares-root-vxvyulc_", "pacman", "-R", "--noconfirm", "xf86-video-ati") 
    ..  Finished. Exit code: 0 output:
 checking dependencies...

Package (1)     Old Version  Net Change

xf86-video-ati  19.1.0-1      -0.51 MiB

Total Removed Size:  0.51 MiB

:: Do you want to remove these packages? [Y/n] 
:: Processing package changes...
removing xf86-video-ati...
16:28:52 [6]: static CalamaresUtils::ProcessResult CalamaresUtils::System::runCommand(CalamaresUtils::System::RunLocation, const QStringList&, const QString&, const QString&, std::chrono::seconds)
    Running "chroot" ("/tmp/calamares-root-vxvyulc_", "pacman", "-R", "--noconfirm", "xf86-video-vmware") 
    ..  Finished. Exit code: 0 output:
 checking dependencies...

Package (1)        Old Version  Net Change

xf86-video-vmware  13.3.0-10     -0.18 MiB

Total Removed Size:  0.18 MiB

:: Do you want to remove these packages? [Y/n] 
:: Processing package changes...
removing xf86-video-vmware...
16:28:52 [6]: static CalamaresUtils::ProcessResult CalamaresUtils::System::runCommand(CalamaresUtils::System::RunLocation, const QStringList&, const QString&, const QString&, std::chrono::seconds)
    Running "chroot" ("/tmp/calamares-root-vxvyulc_", "pacman", "-Rncs", "--noconfirm", "xf86-input-wacom") 
    ..  Finished. Exit code: 0 output:
 checking dependencies...

Package (2)       Old Version  Net Change

wacomtablet       3.2.0-1       -2.68 MiB
xf86-input-wacom  0.40.0-1      -0.24 MiB

Total Removed Size:  2.92 MiB

:: Do you want to remove these packages? [Y/n] 
:: Processing package changes...
removing wacomtablet...
removing xf86-input-wacom...
:: Running post-transaction hooks...
(1/1) Updating the desktop file MIME type cache...
16:28:53 [6]: virtual void Calamares::JobThread::run()
    Starting job "nonfree_drivers" ( 33 / 37 ) 
16:28:53 [6]: virtual Calamares::JobResult Calamares::PythonJob::exec()
    Job file "/usr/lib/calamares/modules/nonfree_drivers/main.py" 
    ..  Job description from __doc__ "nonfree_drivers" = "Setup graphics drivers and sound" 
16:28:53 [2]: boost::python::api::object CalamaresPython::GlobalStoragePythonWrapper::value(const string&) const
    WARNING: Unknown GS key licenseAgree 
16:28:53 [6]: virtual void Calamares::JobThread::run()
    Starting job "package_removal" ( 34 / 37 ) 
16:28:53 [6]: virtual Calamares::JobResult Calamares::PythonJob::exec()
    Job file "/usr/lib/calamares/modules/package_removal/main.py" 
    ..  Job description from __doc__ "package_removal" = "Package removal module. Live only packages, surplus language packs." 
16:28:53 [6]: static CalamaresUtils::ProcessResult CalamaresUtils::System::runCommand(CalamaresUtils::System::RunLocation, const QStringList&, const QString&, const QString&, std::chrono::seconds)
    Running "chroot" ("/tmp/calamares-root-vxvyulc_", "pacman", "-Rns", "--noconfirm", "calamares", "calamares-debug", "console-setup") 
    ..  Finished. Exit code: 0 output:
 checking dependencies...

Package (5)      Old Version  Net Change 

libpwquality     1.4.4-1        -0.38 MiB
yaml-cpp         0.6.3-3        -0.45 MiB
calamares        3.2.39.3-3    -11.47 MiB
calamares-debug  3.2.39.3-3   -109.36 MiB
console-setup    1.202-1        -0.14 MiB

Total Removed Size:  121.80 MiB

:: Do you want to remove these packages? [Y/n] 
:: Processing package changes...
removing console-setup...
removing calamares-debug...
removing calamares...
removing yaml-cpp...
removing libpwquality...
:: Running post-transaction hooks...
(1/1) Updating the desktop file MIME type cache...
16:28:53 [6]: static CalamaresUtils::ProcessResult CalamaresUtils::System::runCommand(CalamaresUtils::System::RunLocation, const QStringList&, const QString&, const QString&, std::chrono::seconds)
    Running "chroot" ("/tmp/calamares-root-vxvyulc_", "pacman", "-Rns", "--noconfirm", "welcome") 
    ..  Finished. Exit code: 0 output:
 checking dependencies...

Package (1)  Old Version  Net Change

welcome      7.4-1         -3.00 MiB

Total Removed Size:  3.00 MiB

:: Do you want to remove these packages? [Y/n] 
:: Processing package changes...
removing welcome...
:: Running post-transaction hooks...
(1/1) Updating the desktop file MIME type cache...
16:28:53 [6]: static CalamaresUtils::ProcessResult CalamaresUtils::System::runCommand(CalamaresUtils::System::RunLocation, const QStringList&, const QString&, const QString&, std::chrono::seconds)
    Running "chroot" ("/tmp/calamares-root-vxvyulc_", "pacman", "-Rns", "--noconfirm", "hardware-detection") 
    ..  Finished. Exit code: 0 output:
 checking dependencies...

Package (3)         Old Version    Net Change

khd-nvidia          1:465.24.02-3    0.00 MiB
khd-nvidia-390xx    390.141-8        0.00 MiB
hardware-detection  2021317-1       -0.06 MiB

Total Removed Size:  0.06 MiB

:: Do you want to remove these packages? [Y/n] 
:: Processing package changes...
removing hardware-detection...
removing khd-nvidia-390xx...
removing khd-nvidia...
16:28:53 [6]: static CalamaresUtils::ProcessResult CalamaresUtils::System::runCommand(CalamaresUtils::System::RunLocation, const QStringList&, const QString&, const QString&, std::chrono::seconds)
    Running "chroot" ("/tmp/calamares-root-vxvyulc_", "pacman", "-R", "--noconfirm", "init-live") 
    ..  Finished. Exit code: 0 output:
 checking dependencies...

Package (1)  Old Version  Net Change

init-live    2020.03-1      0.00 MiB

Total Removed Size:  0.00 MiB

:: Do you want to remove these packages? [Y/n] 
:: Processing package changes...
removing init-live...
Disabling systemd service
Removed /etc/systemd/system/multi-user.target.wants/live.service.
16:28:53 [6]: static CalamaresUtils::ProcessResult CalamaresUtils::System::runCommand(CalamaresUtils::System::RunLocation, const QStringList&, const QString&, const QString&, std::chrono::seconds)
    Running "chroot" ("/tmp/calamares-root-vxvyulc_", "pacman", "-Rncs", "--noconfirm", "grub") 
    ..  Finished. Exit code: 0 output:
 checking dependencies...

Package (3)       Old Version  Net Change

grub-theme-midna  3.2-1         -0.64 MiB
grub2-editor      0.8.1-4       -0.84 MiB
grub              2.04-3       -29.53 MiB

Total Removed Size:  31.02 MiB

:: Do you want to remove these packages? [Y/n] 
:: Running pre-transaction hooks...
(1/1) Removing old entries from the info directory file...
:: Processing package changes...
removing grub2-editor...
removing grub-theme-midna...
removing grub...
16:28:53 [6]: static CalamaresUtils::ProcessResult CalamaresUtils::System::runCommand(CalamaresUtils::System::RunLocation, const QStringList&, const QString&, const QString&, std::chrono::seconds)
    Running "chroot" ("/tmp/calamares-root-vxvyulc_", "pacman", "-R", "--noconfirm", "virtualbox-guest-utils", "virtualbox-guest-modules") 
    ..  Finished. Exit code: 0 output:
 checking dependencies...

Package (2)               Old Version  Net Change

virtualbox-guest-modules  6.1.20-2      -0.80 MiB
virtualbox-guest-utils    6.1.20-2      -8.20 MiB

Total Removed Size:  9.01 MiB

:: Do you want to remove these packages? [Y/n] 
:: Processing package changes...
removing virtualbox-guest-utils...
removing virtualbox-guest-modules...
Unloading modules:
16:28:58 [6]: virtual void Calamares::JobThread::run()
    Starting job "bootldr" ( 35 / 37 ) 
16:28:58 [6]: virtual Calamares::JobResult Calamares::PythonJob::exec()
    Job file "/usr/lib/calamares/modules/bootldr/main.py" 
[PYTHON JOB]:  "1a3ab795-2f6a-43e8-b674-fd96f208f039" 
[PYTHON JOB]:  "/dev/mmcblk0p1" 
16:28:58 [6]: virtual void Calamares::JobThread::run()
    Starting job "gummi_entries" ( 36 / 37 ) 
16:28:58 [6]: virtual Calamares::JobResult Calamares::PythonJob::exec()
    Job file "/usr/lib/calamares/modules/gummi_entries/main.py" 
16:28:58 [6]: virtual void Calamares::JobThread::run()
    Starting job "umount" ( 37 / 37 ) 
16:28:58 [6]: virtual Calamares::JobResult Calamares::PythonJob::exec()
    Job file "/usr/lib/calamares/modules/umount/main.py" 
16:28:58 [6]: boost::python::api::object CalamaresPython::gettext_path()
    Determining gettext path from ("/home/live", "/usr/bin", "/usr/share/locale") 
    ..  Found "en_US" in "/usr/share/locale/en_US" 
    ..  Job description from pretty_name "umount" = "Unmount file systems."